{"text_format":"1","workbook":"xlsx","n_sheets":14,"sheets":["Prompt","S100","Mod02","Mod03","Mod04","Mod05","Mod06","Mod07","Mod77","Mod08","Mod09","Mod10","Enviar","Ubigeo_UGEL"],"not_rendered":{"charts":0,"images":10,"macros":1,"external_links":0,"defined_names":20,"comments":1,"pivot_tables":0},"unopened":[],"bounds":{"document_bytes":16777216,"sheet_cells":100000,"rows_first":2000,"rows_last":500,"rows_between":2000,"halvings":0,"cell_chars":16384,"cell_head_chars":4096},"cells_cut":0,"cells_raw":0,"read":"whole","date_system":"1900"}

{"sheet":"Prompt","index":0,"n_rows":79,"n_cols":4,"rows_kept":79,"cut":false,"hidden":true,"merged":[[78,1,79,8],[1,3,2,5],[4,1,6,8],[9,1,10,8],[43,1,44,8]]}
[]
[null,null,null,"¡ATENCIÓN!"]
[]
[]
[null,"Para hacer uso de las funcionalidades de esta Cédula Electrónica debe habilitar macros"]
[]
[]
[]
[]
[null,"Si utiliza Excel 2013 siga el siguiente procedimiento:"]
[]
[]
[]
[]
[]
[]
[]
[]
[]
[]
[]
[]
[]
[]
[]
[]
[]
[]
[]
[]
[]
[]
[]
[]
[]
[]
[]
[]
[]
[]
[]
[]
[]
[null,"Si utiliza Excel 2007 siga el siguiente procedimiento:"]
[]
[]
[]
[]
[]
[]
[]
[]
[]
[]
[]
[]
[]
[]
[]
[]
[]
[]
[]
[]
[]
[]
[]
[]
[]
[]
[]
[]
[]
[]
[]
[]
[]
[]
[null,"Si utiliza Excel 2000, 2002, 2003 siga el siguiente procedimiento:"]

{"sheet":"S100","index":1,"n_rows":302,"n_cols":43,"rows_kept":302,"cut":false,"hidden":false,"merged":[[183,35,184,38],[185,11,185,12],[185,13,185,14],[195,11,195,12],[195,13,195,14],[186,11,186,12],[186,13,186,14],[187,11,187,12],[188,11,188,12],[189,11,189,12],[190,11,190,12],[191,11,191,12],[192,11,192,12],[193,11,193,12],[194,11,194,12],[187,13,187,14],[188,13,188,14],[189,13,189,14],[190,13,190,14],[191,13,191,14],[192,13,192,14],[193,13,193,14],[194,13,194,14],[189,26,189,34],[71,31,71,33],[71,34,71,36],[71,37,71,38],[60,25,60,30],[61,25,61,30],[71,25,71,30],[62,25,62,30],[63,25,63,30],[64,25,64,30],[65,25,65,30],[66,25,66,30],[67,25,67,30],[68,25,68,30],[69,25,69,30],[70,25,70,30],[69,31,69,33],[69,34,69,36],[69,37,69,38],[65,31,65,33],[65,34,65,36],[65,37,65,38],[62,31,62,33],[62,34,62,36],[62,37,62,38],[70,31,70,33],[70,34,70,36],[70,37,70,38],[67,7,67,8],[67,10,67,19],[67,31,67,33],[67,34,67,36],[67,37,67,38],[68,7,68,8],[68,10,68,19],[68,31,68,33],[68,34,68,36],[68,37,68,38],[69,7,69,8],[69,10,69,19],[70,7,70,8],[63,31,63,33],[63,34,63,36],[63,37,63,38],[64,7,64,8],[64,10,64,19],[64,31,64,33],[64,34,64,36],[64,37,64,38],[66,7,66,8],[66,10,66,19],[66,31,66,33],[66,34,66,36],[66,37,66,38],[59,31,59,33],[59,34,59,36],[59,37,59,38],[60,7,60,8],[60,10,60,19],[60,31,60,33],[60,34,60,36],[60,37,60,38],[61,7,61,8],[61,10,61,19],[61,31,61,33],[61,34,61,36],[61,37,61,38],[58,7,59,8],[58,9,59,9],[144,9,144,11],[137,9,137,11],[142,9,142,11],[140,9,140,11],[226,10,226,18],[155,26,155,27],[147,26,147,27],[148,26,148,27],[149,26,149,27],[150,26,150,27],[151,26,151,27],[152,26,152,27],[153,26,153,27],[195,8,195,10],[191,8,191,10],[192,8,192,10],[193,8,193,10],[190,26,190,34],[185,19,185,25],[186,19,186,25],[187,19,187,25],[188,19,188,25],[183,8,183,10],[158,7,158,8],[147,7,147,8],[154,9,154,11],[158,9,158,11],[190,19,190,25],[133,31,133,39],[138,7,138,8],[146,28,146,30],[140,7,140,8],[141,7,141,8],[142,7,142,8],[143,7,143,8],[144,7,144,8],[145,7,145,8],[146,7,146,8],[138,26,138,27],[139,26,139,27],[140,26,140,27],[141,26,141,27],[142,26,142,27],[143,26,143,27],[144,26,144,27],[145,26,145,27],[139,28,139,30],[145,9,145,11],[148,9,148,11],[150,7,150,8],[151,7,151,8],[149,7,149,8],[184,11,184,12],[184,13,184,14],[194,19,194,25],[191,19,191,25],[149,9,149,11],[150,9,150,11],[194,8,194,10],[183,11,183,14],[148,7,148,8],[185,8,185,10],[152,7,152,8],[153,7,153,8],[154,7,154,8],[155,7,155,8],[156,7,156,8],[186,8,186,10],[183,19,183,25],[157,7,157,8],[22,11,22,37],[26,11,26,37],[37,37,37,39],[36,31,36,34],[36,23,36,24],[37,25,37,26],[46,9,48,13],[36,25,36,26],[37,7,37,20],[37,23,37,24],[36,7,36,20],[36,37,36,39],[2,36,3,39],[14,30,14,32],[18,30,18,39],[10,5,10,40],[16,10,16,18],[17,10,17,18],[14,10,14,12],[18,10,18,18],[18,21,19,28],[2,14,2,34],[5,23,5,27],[134,7,134,8],[133,12,133,23],[136,7,136,8],[135,9,135,11],[136,9,136,11],[133,28,133,30],[134,26,134,27],[135,26,135,27],[136,26,136,27],[133,9,133,11],[136,28,136,30],[133,7,133,8],[134,28,134,30],[133,26,133,27],[135,28,135,30],[135,7,135,8],[134,9,134,11],[137,7,137,8],[152,9,152,11],[157,9,157,11],[155,9,155,11],[156,9,156,11],[147,9,147,11],[146,9,146,11],[144,28,144,30],[145,28,145,30],[143,9,143,11],[143,28,143,30],[149,28,149,30],[150,28,150,30],[151,28,151,30],[148,28,148,30],[140,28,140,30],[142,28,142,30],[139,7,139,8],[137,28,137,30],[138,28,138,30],[138,9,138,11],[139,9,139,11],[141,9,141,11],[151,9,151,11],[1,36,1,39],[1,14,1,34],[3,13,3,35],[30,30,30,31],[191,35,191,38],[192,35,192,38],[193,35,193,38],[194,35,194,38],[183,15,183,18],[176,19,176,25],[174,21,174,27],[161,5,161,40],[185,35,185,38],[36,27,36,30],[37,27,37,30],[40,7,40,39],[37,21,37,22],[37,31,37,34],[36,35,36,36],[37,35,37,36],[39,37,39,38],[141,28,141,30],[137,26,137,27],[186,26,186,34],[195,35,195,38],[186,35,186,38],[187,35,187,38],[153,9,153,11],[146,26,146,27],[152,28,152,30],[195,19,195,25],[192,26,192,34],[193,26,193,34],[194,26,194,34],[193,19,193,25],[166,38,166,39],[170,33,170,36],[168,33,168,36],[166,33,166,36],[187,8,187,10],[188,8,188,10],[189,8,189,10],[190,8,190,10],[190,15,190,18],[188,35,188,38],[189,35,189,38],[190,35,190,38],[147,28,147,30],[158,28,158,30],[153,28,153,30],[157,26,157,27],[154,28,154,30],[156,28,156,30],[156,26,156,27],[158,26,158,27],[155,28,155,30],[157,28,157,30],[154,26,154,27],[213,32,213,33],[185,15,185,18],[186,15,186,18],[195,15,195,18],[191,15,191,18],[192,15,192,18],[193,15,193,18],[194,15,194,18],[195,26,195,34],[212,32,212,33],[192,19,192,25],[211,12,211,19],[187,15,187,18],[188,15,188,18],[189,15,189,18],[188,26,188,34],[189,19,189,25],[209,32,209,33],[210,32,210,33],[211,32,211,33],[187,26,187,34],[185,26,185,34],[191,26,191,34],[51,10,51,23],[60,20,60,24],[61,20,61,24],[71,20,71,24],[62,20,62,24],[63,20,63,24],[64,20,64,24],[65,20,65,24],[66,20,66,24],[67,20,67,24],[68,20,68,24],[69,20,69,24],[70,20,70,24],[62,7,62,8],[62,10,62,19],[65,7,65,8],[65,10,65,19],[71,7,71,8],[71,10,71,19],[70,10,70,19],[63,7,63,8],[63,10,63,19]]}
[]
[null,null,null,null,null,null,null,null,null,null,null,null,null,null,"CENSO EDUCATIVO 2026",null,null,null,null,null,null,null,null,null,null,null,null,null,null,null,null,null,null,null,null,null,"CÉDULA"]
[null,null,null,null,null,null,null,null,null,null,null,null,null,null,"LOCAL EDUCATIVO",null,null,null,null,null,null,null,null,null,null,null,null,null,null,null,null,null,null,null,null,null,11]
[null,null,null,null,null,"Versión :",null,"GA-1.0",null,null,null,null,null,"REGISTRO DE DIAGNÓSTICO DE LA INFRAESTRUCTURA EDUCATIVA"]
[]
[null,null,null,null,null,null,null,null,null,null,null,null,null,null,null,"CÓDIGO DEL LOCAL EDUCATIVO :"]
[]
[]
[]
[]
[null,null,null,null,null,"CAPÍTULO 1: DATOS GENERALES DEL LOCAL EDUCATIVO"]
[]
[null,null,null,null,null,null,"SECCIÓN 1: UBICACIÓN GEOGRÁFICA"]
[]
[null,null,null,null,null,null,"CÓDIGO DE UBIGEO",null,null,null,null,null,null,null,null,null,null,null,null,null,null,"CÓDIGO DEPENDENCIA ADMINISTRATIVA :"]
[]
[null,null,null,null,null,null,"1.1.1. DEPARTAMENTO :",null,null,null,{"$f":"IF(ISERROR(VLOOKUP(K15,UBIGEO,2,FALSE)),\"\",VLOOKUP(K15,UBIGEO,2,FALSE))","v":""},null,null,null,null,null,null,null,null,null,null,"1.1.4. DEPENDENCIA ADMINISTRATIVA:",null,null,null,null,null,null,null,null,null,"GRE",null,null,"DRE",null,null,"UGEL"]
[null,null,null,null,null,null,"1.1.2. PROVINCIA :",null,null,null,{"$f":"IF(ISERROR(VLOOKUP(K15,UBIGEO,3,FALSE)),\"\",VLOOKUP(K15,UBIGEO,3,FALSE))","v":""}]
[null,null,null,null,null,null,"1.1.3. DISTRITO :",null,null,null,{"$f":"IF(ISERROR(VLOOKUP(K15,UBIGEO,4,FALSE)),\"\",VLOOKUP(K15,UBIGEO,4,FALSE))","v":""},null,null,null,null,null,null,null,null,null,"","1.1.5. NOMBRE DE DEPENDENCIA ADMINISTRATIVA:",null,null,null,null,null,null,null,null,{"$f":"IF(ISERROR(VLOOKUP(AE15,UGEL,2,FALSE)),\"\",VLOOKUP(AE15,UGEL,2,FALSE))","v":""}]
[]
[]
[]
[null,null,null,null,null,null,"1.1.6. CENTRO POBLADO:"]
[]
[null,null,null,null,null,null,"Tipo de centro poblado:",null,null,null,null,null,"Caserío",null,null,null,"Pueblo",null,null,"Villa",null,"Ciudad",null,null,"Comunidad",null,null,null,"Anexo"]
[]
[null,null,null,null,null,null,"1.1.7. NÚCLEO URBANO:"]
[null,null,null,null,null,null,null,null,null,""]
[null,null,null,null,null,null,"Tipo de núcleo urbano:",null,null,null,null,null,"Cercado",null,null,null,null,"Urbanización",null,null,null,"Barrio",null,null,"Complejo Habitacional",null,null,null,null,null,"Unidad vecinal",null,null,null,null,"Asociación de  Vivienda"]
[]
[null,null,null,null,null,null,null,null,null,null,null,null,"Coop. Vivienda",null,null,null,null,"Ciudadela",null,null,null,"AA.HH.",null,null,"Pueblo Joven",null,null,null,null,null,"Otro"]
[null,null,null,null,null,null,null,null,null,""]
[null,null,null,null,null,null,"1.1.8. DIRECCIÓN PRINCIPAL DEL LOCAL EDUCATIVO"]
[]
[null,null,null,null,null,null,"Tipo de vía:",null,null,null,"Avenida",null,null,"Calle",null,null,"Jirón",null,null,"Pasaje",null,"Autopista",null,"Carretera",null,null,null,"Alameda",null,null,"Parque",null,null,"Otro"]
[]
[null,null,null,null,null,null,null,"Nombre de la vía",null,null,null,null,null,null,null,null,null,null,null,null,null,"N° de puerta",null,"Mz.",null,"Lote",null,"Sector",null,null,null,"Zona",null,null,null,"Etapa",null,"Otro"]
[null,null,null,null,null,null,null,""]
[]
[null,null,null,null,null,null,"1.1.9. REFERENCIA DE LA DIRECCIÓN DEL LOCAL EDUCATIVO  (Texto de 200 caracteres)",null,null,null,null,null,null,null,null,null,null,null,null,null,null,null,null,null,null,null,null,null,null,"Número de caracteres registrados :",null,null,null,null,null,null,null,{"$f":"LEN(TRIM(H41))","v":0}]
[null,null,null,null,null,null,null,""]
[null,null,null,null,null,null,null,"Ejemplos: 1. A la altura de la cuadra 34 de la Av. Aviación. 2. A una cuadra de la Plaza de Armas del distrito. 3. Frente al Hospital El Carmen."]
[null,null,null,null,null,null,null,"4. Entre los centros poblados de San Pedro, Accos y Lares. 5. Al pie de la carretera, aprox. 200m del desvío al poblado de Lucre."]
[]
[null,null,null,null,null,null,"1.1.10. PUNTOS DE GEORREFERENCIACIÓN"]
[]
[null,null,null,null,null,null,"LATITUD",null,":","Utilice la APP GeoLOCALES censo"]
[null,null,null,null,null,null,"LONGITUD",null,":"]
[null,null,null,null,null,null,"ALTITUD",null,":"]
[]
[null,null,null,null,null,null,null,null,null,null,"NOTA:"]
[null,null,null,null,null,null,null,null,null,null,"Las coordenadas de ubicación del Local Educativo deben obtenerse únicamente mediante el uso del aplicativo móvil de georreferenciación para celulares (Android) llamado “GeoLOCALES” Videos tutoriales y más recursos en: "]
[null,null,null,null,null,null,null,null,null,null,"recursos/materiales en:",null,null,null,null,"https://goo.su/9fyzAz"]
[null,null,null,null,null,null,null,null,null,null,"Play Store:",null,null,"https://goo.su/opLECxx"]
[]
[null,null,null,null,null,null,"SECCIÓN 2: INFORMACIÓN DE LOS SERVICIOS O NIVELES EDUCATIVOS"]
[null,null,null,null,null,null,"1.2.1. SERVICIOS/NIVELES EDUCATIVOS QUE FUNCIONAN EN EL LOCAL EDUCATIVO"]
[null,null,null,null,null,null,"Registre en primer lugar el código modular del servicio educativo que está llenando esta cédula."]
[null,null,null,null,null,null,{"$f":"SUM(D61:D72)","v":0},"(1)\nCódigo modular",null,"Anexo",null,null,null,null,null,"(3)",null,null,null,null,null,"(4)",null,null,null,null,null,"(5)",null,null,null,"(6) ) Sobre el (los) local(es) adicional(es)"]
["GESTIÓN",{"$f":"IF(B61>0,1,IF(AND(B61=0,B64>0),3,9))","v":9},null,{"$f":"SUM(D61:D72)","v":0},null,null,"Nº",null,null,null,"Nombre del servicio/nivel educativo",null,null,null,null,null,null,null,null,null,null,"Gestión",null,null,null,null,"Nivel y/o modalidad",null,null,null,null,"¿Cuenta con un Local Adicional?",null,null,"¿Tiene Código de Local Educativo?",null,null,"Código de Local Educativo"]
[{"$f":"LEFT(U61,2)","v":""},{"$f":"IF(OR(B62>0,B63>0),1,0)","v":0},null,{"$f":"IF(H61<>\"\",1,0)","v":0},null,null,1]
["",{"$f":"COUNTIF($A$61:$A$72,\"01\")","v":0},null,{"$f":"IF(H62<>\"\",1,0)","v":0},null,null,2]
["",{"$f":"COUNTIF($A$61:$A$72,\"02\")","v":0},null,0,null,null,3]
["",{"$f":"IF(B65>0,3,0)","v":0},null,0,null,null,4]
["",{"$f":"COUNTIF($A$61:$A$72,\"03\")","v":0},null,0,null,null,5]
["",null,null,0,null,null,6]
["",null,null,0,null,null,7]
["",null,null,0,null,null,8]
["",null,null,0,null,null,9]
["",null,null,0,null,null,10]
["",null,null,0,null,null,11]
["",null,null,0,null,null,12]
[null,null,null,null,null,null,null,null,null,null,null,null,null,null,null,null,null,null,null,null,null,null,null,null,null,null,null,null,null,null,null,null,{"$f":"COUNTIF(AF61:AG72,\"SI\")+COUNTIF(AF61:AG72,\"NO\")","v":0}]
[]
[]
[]
[]
[]
[]
[]
[]
[]
[]
[]
[]
[]
[]
[]
[]
[]
[]
[]
[]
[]
[]
[]
[]
[]
[]
[]
[]
[]
[]
[]
[]
[]
[]
[]
[]
[]
[]
[]
[]
[]
[]
[]
[]
[]
[]
[]
[]
[]
[]
[]
[]
[]
[null,null,null,null,null,null,"1.2.2. EN ESTE LOCAL EDUCATIVO, ¿FUNCIONA ALGÚN INSTITUTO O ESCUELA DE EDUCACIÓN SUPERIOR? "]
[]
[null,null,null,null,null,null,null,null,null,"","Sí",null,null,null,null,null,null,null,"No",null,null,"Pase al capítulo 2"]
[]
[]
[null,null,null,null,null,null,"1.2.3. LISTADO DE CARRERAS O PROGRAMAS DE ESTUDIO OFRECIDOS EN ESTE LOCAL EDUCATIVO POR EL INSTITUTO O ESCUELA DE EDUCACIÓN SUPERIOR"]
[]
[null,null,null,null,null,null,"Nº","Nivel de Educación Superior",null,"Código de Carrera",null,null,"Nombre de la carrera de Educación Superior No Universitaria",null,null,null,null,null,null,null,null,null,null,null,null,"Nº","Nivel de Educación Superior",null,"Código de Carrera",null,null,"Nombre de la carrera de Educación Superior No Universitaria"]
[{"$f":"IF(OR(H135<>\"\",J135<>\"\",M135<>\"\"),1,0)","v":0},{"$f":"IF(OR(AA135<>\"\",AC135<>\"\",AF135<>\"\"),1,0)","v":0},{"$f":"IF(AND(H135=\"\",J135=\"\",AA135=\"\",AC135=\"\"),1,0)","v":1},null,null,null,"01","",null,null,null,null,{"$f":"IF(ISERROR(VLOOKUP(J135,carreras,2,FALSE)),\"\",VLOOKUP(J135,carreras,2,FALSE))","v":""},null,null,null,null,null,null,null,null,null,null,null,null,26,"",null,"",null,null,{"$f":"IF(ISERROR(VLOOKUP(AC135,carreras,2,FALSE)),\"\",VLOOKUP(AC135,carreras,2,FALSE))","v":""}]
[{"$f":"IF(OR(H136<>\"\",J136<>\"\",M136<>\"\"),1,0)","v":0},{"$f":"IF(OR(AA136<>\"\",AC136<>\"\",AF136<>\"\"),1,0)","v":0},1,null,null,null,"02","",null,null,null,null,"",null,null,null,null,null,null,null,null,null,null,null,null,27,"",null,"",null,null,""]
[0,0,1,null,null,null,"03","",null,"",null,null,"",null,null,null,null,null,null,null,null,null,null,null,null,28,"",null,"",null,null,""]
[0,0,1,null,null,null,"04","",null,"",null,null,"",null,null,null,null,null,null,null,null,null,null,null,null,29,"",null,"",null,null,""]
[0,0,1,null,null,null,"05","",null,"",null,null,"",null,null,null,null,null,null,null,null,null,null,null,null,30,"",null,"",null,null,""]
[0,0,1,null,null,null,"06","",null,"",null,null,"",null,null,null,null,null,null,null,null,null,null,null,null,31,"",null,"",null,null,""]
[0,0,1,null,null,null,"07","",null,"",null,null,"",null,null,null,null,null,null,null,null,null,null,null,null,32,"",null,"",null,null,""]
[0,0,1,null,null,null,"08","",null,"",null,null,"",null,null,null,null,null,null,null,null,null,null,null,null,33,"",null,"",null,null,""]
[0,0,1,null,null,null,"09","",null,"",null,null,"",null,null,null,null,null,null,null,null,null,null,null,null,34,"",null,"",null,null,""]
[0,0,1,null,null,null,10,"",null,"",null,null,"",null,null,null,null,null,null,null,null,null,null,null,null,35,"",null,"",null,null,""]
[{"$f":"IF(OR(H145<>\"\",J145<>\"\",M145<>\"\"),1,0)","v":0},0,1,null,null,null,11,"",null,"",null,null,{"$f":"IF(ISERROR(VLOOKUP(J145,carreras,2,FALSE)),\"\",VLOOKUP(J145,carreras,2,FALSE))","v":""},null,null,null,null,null,null,null,null,null,null,null,null,36,"",null,"",null,null,""]
[0,0,1,null,null,null,12,"",null,"",null,null,"",null,null,null,null,null,null,null,null,null,null,null,null,37,"",null,"",null,null,""]
[0,0,1,null,null,null,13,"",null,"",null,null,"",null,null,null,null,null,null,null,null,null,null,null,null,38,"",null,"",null,null,""]
[0,0,1,null,null,null,14,"",null,"",null,null,"",null,null,null,null,null,null,null,null,null,null,null,null,39,"",null,"",null,null,""]
[0,0,1,null,null,null,15,"",null,"",null,null,"",null,null,null,null,null,null,null,null,null,null,null,null,40,"",null,"",null,null,""]
[0,0,1,null,null,null,16,"",null,"",null,null,"",null,null,null,null,null,null,null,null,null,null,null,null,41,"",null,"",null,null,""]
[0,0,1,null,null,null,17,"",null,"",null,null,"",null,null,null,null,null,null,null,null,null,null,null,null,42,"",null,"",null,null,""]
[0,0,1,null,null,null,18,"",null,"",null,null,"",null,null,null,null,null,null,null,null,null,null,null,null,43,"",null,"",null,null,""]
[0,0,1,null,null,null,10,"",null,"",null,null,"",null,null,null,null,null,null,null,null,null,null,null,null,44,"",null,"",null,null,""]
[0,0,1,null,null,null,20,"",null,"",null,null,"",null,null,null,null,null,null,null,null,null,null,null,null,45,"",null,"",null,null,""]
[0,0,1,null,null,null,21,"",null,"",null,null,"",null,null,null,null,null,null,null,null,null,null,null,null,46,"",null,"",null,null,""]
[0,0,1,null,null,null,22,"",null,"",null,null,"",null,null,null,null,null,null,null,null,null,null,null,null,47,"",null,"",null,null,""]
[0,0,1,null,null,null,23,"",null,"",null,null,"",null,null,null,null,null,null,null,null,null,null,null,null,48,"",null,"",null,null,""]
[0,0,1,null,null,null,24,"",null,"",null,null,"",null,null,null,null,null,null,null,null,null,null,null,null,49,"",null,"",null,null,""]
[0,0,1,null,null,null,25,"",null,"",null,null,{"$f":"IF(ISERROR(VLOOKUP(J159,carreras,2,FALSE)),\"\",VLOOKUP(J159,carreras,2,FALSE))","v":""},null,null,null,null,null,null,null,null,null,null,null,null,50,"",null,"",null,null,""]
[null,{"$f":"SUM(A135:B159)","v":0},{"$f":"SUM(C135:C159)","v":25}]
[]
[null,null,null,null,null,"CAPÍTULO 2: CARACTERÍSTICAS DEL LOCAL EDUCATIVO"]
[]
["Salto construcción",null,null,null,null,null,"SECCIÓN 1: SOBRE LA CONSTRUCCION Y/O RECONSTRUCCION DEL LOCAL EDUCATIVO"]
[null,null,null,null,null,null,"2.1.1. ¿EL LOCAL EDUCATIVO SE ENCUENTRA EN CONSTRUCCIÓN/RECONSTRUCCIÓN?",null,null,null,null,null,null,null,null,null,null,null,null,null,null,null,{"$f":"CONCATENATE(K171,P167)","v":""},"2.1.2. SOBRE LA CONSTRUCCIÓN/RECONSTRUCCIÓN TOTAL DEL LOCAL EDUCATIVO, INDIQUE:"]
[{"$f":"LEFT(Y113,1)","v":""},{"$f":"COUNTIF($A$166:$A$177,\"A\")","v":0},"Inicial",{"$f":"LEFT(Y113,2)","v":""}]
["",{"$f":"COUNTIF($A$166:$A$177,\"B\")","v":0},"Primaria","",null,null,null,null,"Sí",null,null,null,null,null,null,null,"No",null,"}}","Pase a la sección 2",null,null,null,null,"Fecha de inicio de la obra:",null,null,null,null,null,null,"Mes",null,null,null,null,null,"Año"]
["",{"$f":"COUNTIF($A$166:$A$177,\"F\")","v":0},"Secundaria",""]
["",{"$f":"COUNTIF($A$166:$A$177,\"E\")","v":0},"EBE","",null,null,null,null,null,null,null,"Total",null,null,null,null,null,null,null,null,null,null,null,null,"Plazo de ejecución:"]
["",{"$f":"COUNTIF($A$166:$A$177,\"D\")","v":0},"EBA","",null,null,null,null,null,null,""]
["",{"$f":"COUNTIF($A$166:$A$177,\"L\")","v":0},"ETP","",null,null,null,null,null,null,null,"Parcial",null,null,"}}","Pase a la pregunta 2.1.4",null,null,null,null,null,null,null,null,"Código Único de Inversión (CUI) de la obra:",null,null,null,null,null,null,null,null,null,null,null,null,"(Solo si cuenta con CUI)",null,null,null,"",""]
["",{"$f":"COUNTIF($A$166:$A$177,\"K\")","v":0},"ISP",""]
["",{"$f":"COUNTIF($A$166:$A$177,\"T\")","v":0},"IST","",null,{"$f":"CONCATENATE(H175,H176,H177,Q175,Q176,Q177)","v":""},"2.1.3. ¿QUÉ ENTIDAD FINANCIA LA OBRA DEL LOCAL EDUCATIVO?",null,null,null,null,null,null,null,null,null,null,null,null,"Marque con una “X” solo una opción"]
["",{"$f":"COUNTIF($A$166:$A$177,\"M\")","v":0},"ESFA",""]
["",{"$f":"COUNTIF($A$166:$A$177,\"P\")","v":0},"EESP","",null,null,null,null,"MINEDU",null,null,null,null,null,null,null,null,"Otro Sector del Estado"]
["",{"$f":"COUNTIF($A$166:$A$177,\"S\")","v":0},"EEST","",null,null,null,null,"Gobierno Regional",null,null,null,null,null,null,null,null,"Empresa Privada",null,null,null,null,null,null,null,null,null,null,null,null,null,"}}","Pase a la sección 2"]
["",null,null,"",null,null,null,null,"Gobierno Local",null,null,null,null,null,null,null,null,"Otro"]
["SUPERIOR",{"$f":"SUM(B172:B176)","v":0},{"$f":"IF(B178>0,\"X\",\"\")","v":""}]
[]
[]
[null,null,null,null,null,null,"2.1.4. SOBRE LA CONSTRUCCIÓN/RECONSTRUCCIÓN PARCIAL DEL LOCAL EDUCATIVO, INDIQUE:"]
[null,null,null,null,null,null,null,"Si una única obra de construcción o reconstrucción beneficia a más de un servicio educativo, REGISTRE el código modular de la que tenga mayor nivel o jerarquía."]
[null,null,null,null,null,null,null,"En los casos que se esté realizando dos o más obras independientes en el local educativo, detalle la información por cada una de ellas."]
[null,{"$f":"SUM(B185:B196)","v":0},{"$f":"SUM(C185:C196)","v":11},null,null,null,null,"Nº","Código Modular",null,null,"Fecha de inicio de la obra",null,null,null,"Plazo de ejecución",null,null,null,"Entidad que financia la Intervención",null,null,null,null,null,null,null,null,null,"Especifique",null,null,null,null,null,"Código Único de Inversión (CUI) de la obra"]
[null,null,null,null,null,null,null,null,null,null,null,"Mes",null,"Año",null,"",null,null,null,"",null,null,null,null,null,null,""]
[null,{"$f":"IF(I186<>\"\",1,0)","v":0},{"$f":"IF(OR(I186=\"\",L186=\"\",N186=\"\",P186=\"\",T186=\"\",AJ186=\"\"),1,0)","v":1},null,null,null,null,1]
[null,0,{"$f":"IF(OR(I187=\"\",L187=\"\",P187=\"\",AJ187=\"\"),1,0)","v":1},null,null,null,null,2]
[null,0,1,null,null,null,null,3]
[null,0,1,null,null,null,null,4]
[null,0,1,null,null,null,null,5]
[null,0,1,null,null,null,null,6]
[null,0,1,null,null,null,null,7]
[null,0,1,null,null,null,null,8]
[null,0,1,null,null,null,null,9]
[null,0,1,null,null,null,null,10]
[null,0,1,null,null,null,null,11]
[]
[]
[null,null,null,null,null,null,"SECCIÓN 2: SERVICIOS EDUCATIVOS UBICADOS EN OTRO LUGAR"]
[null,null,null,null,null,null,"2.2.1. ¿LOS SERVICIOS EDUCATIVOS AUTORIZADOS A FUNCIONAR EN ESTE LOCAL ESTÁN FUNCIONANDO EN OTRO LUGAR AL MOMENTO DEL CENSO EDUCATIVO?"]
[]
[null,null,null,null,null,null,{"$f":"CONCATENATE(H202,N202)","v":""},null,"Sí, todos",null,null,null,null,null,"Sí, algunos",null,null,null,null,null,"","No, ninguno",null,null,null,null,null,"Pase a la sección 3"]
[]
[]
[null,null,null,null,null,null,"2.2.2.  ¿EN QUÉ OTRO LUGAR DE MANERA TRANSITORIA SE ENCUENTRAN FUNCIONANDO ACTUALMENTE LOS SERVICIOS EDUCATIVOS?"]
[null,null,null,null,null,null,null,"Marque con una “X” una o más opciones"]
[]
[null,null,null,null,null,null,null,null,null,null,"Local(es) Educativo(s) de otras II.EE.",null,null,null,null,null,null,null,null,null,null,null,null,null,null,null,"Indique el o los códigos de local, según corresponda:"]
[null,null,null,null,null,null,null,null,null,null,"Vivienda privada",null,null,null,null,null,null,null,null,null,null,null,null,null,null,null,null,null,null,null,null,null,null,null,null,{"$f":"SUM(AJ210:AJ214)","v":5}]
[null,null,null,null,null,null,null,null,null,null,"Parque/estadio/coliseo",null,null,null,null,null,null,null,null,null,null,null,null,null,null,null,"Código de local",null,null,1,null,":",null,null,null,{"$f":"IF(AG210=\"\",1,0)","v":1},null,null,null,null,null,""]
[null,null,null,null,null,null,null,null,null,null,"Infraestructura nueva sin código de local asignado",null,null,null,null,null,null,null,null,null,null,null,null,null,null,null,"Código de local",null,null,2,null,":",null,null,null,{"$f":"IF(AG211=\"\",1,0)","v":1},null,null,null,null,null,""]
[null,null,null,null,null,null,null,null,null,null,"Otro",null,null,null,null,null,null,null,null,null,null,null,null,null,null,null,"Código de local",null,null,3,null,":",null,null,null,1,null,null,null,null,null,""]
[null,null,null,null,null,null,null,null,null,null,null,null,null,null,null,null,null,null,null,null,null,null,null,null,null,null,"Código de local",null,null,4,null,":",null,null,null,1]
[null,null,null,null,null,null,null,null,null,null,null,null,null,null,null,null,null,null,null,null,null,null,null,null,null,null,"Código de local",null,null,5,null,":",null,null,null,1]
[]
["TABLA  - Entidad"]
["1: MINEDU",null,null,null,null,null,"2.2.3. ¿POR QUÉ RAZÓN TODOS O ALGUNOS DE LOS SERVICIOS EDUCATIVOS ESTÁN FUNCIONANDO EN OTRO LUGAR?"]
["2: Gob.regional",null,null,null,null,null,null,"(Marque con una “X” solo una opción"]
["3: Gob.Local"]
["4: Otro sector del estado",null,null,null,null,null,null,null,"El local educativo se encuentra en proceso de construcción/reconstrucción total, lo cual impide su uso temporal."]
["5: Empresa privada",null,null,null,null,null,{"$f":"CONCATENATE(H220,H221,H222)","v":""},null,"La construcción/reconstrucción del local educativo está terminada, pero aún no ha sido entregado oficialmente para su uso educativo.",null,null,null,null,null,null,null,null,null,null,null,null,null,null,null,null,null,null,null,null,null,null,null,null,"}}","Finalice el llenado de la cédula censal"]
["6: Otro",null,null,null,null,null,null,null,"Todos los ambientes del local educativo han sido declarados inhabitables."]
[]
[null,null,null,null,null,null,null,null,"El local educativo está en construcción/reconstrucción parcial."]
[null,null,null,null,null,null,null,null,"El local educativo no cuenta con suficientes ambientes.",null,null,null,null,null,null,null,null,null,null,null,null,null,null,"}}","Pase a la sección 3"]
[null,null,null,null,null,null,null,null,"Algunos ambientes del local educativo han sido declarados inhabitables"]
[null,null,null,null,null,null,null,null,"Otro",""]
[]
[]
[]
[]
["TABLA 01 - Gestión"]
["01: Púb. Gestión Directa",null,null,null,null,null,null,null,null,null,null,null,null,null,null,null,null,null,null,null,null,null,null,null,null,null,null,null,null,null,null,null,null,null,null,{"$f":"IF(ISERROR(VLOOKUP(AG233,carreras,2,FALSE)),\"\",VLOOKUP(AG233,carreras,2,FALSE))","v":""}]
["02: Púb. Gestión Privada"]
["03: Privada"]
[]
[]
["TABLA 01 - Nivel"]
["A1: INICIAL - Cuna "]
["A2: INICIAL - Jardín"]
["A3: INICIAL - Cuna Jardín"]
["B0: EBR-Primaria"]
["F0: EBR-Secundaria"]
["D1: EBA-Inicial e Intermedio"]
["D2: EBA-Avanzado"]
["E0: EBE-PRITE"]
["E1: EBE-Inicial"]
["E2: EBE-Primaria"]
["L0: ETP-CETPRO"]
["K0: IES-Pedagógico"]
["T0: IES-Tecnológico"]
["M0: ES-Formación Artística"]
["P0: EES-Pedagógica"]
["S0: EES-Tecnológica"]
[]
[]
[]
["TABLA (SI NO)"]
["SI"]
["NO"]
[]
[]
["Código de Nivel"]
["K0: IESP"]
["T0: IEST"]
["M0: ESFA"]
["P0: EESP"]
["S0: EEST"]
["L0: ETP"]
[]
[]
["TABLA 03 - Carateristica"]
["01: Unidocente"]
["02: Pol.Multigrado"]
["03: Pol.Completo"]
["04: No aplica"]
[]
[]
["Meses"]
["01: Enero"]
["02: Febrero"]
["03: Marzo"]
["04: Abril"]
["05: Mayo"]
["06: Junio"]
["07: Julio"]
["08: Agosto"]
["09: Setiembre"]
["10: Octubre"]
["11: Noviembre"]
["12: Diciembre"]
[]
[]
[]
["Código de Nivel"]
["15: Prof. Pedagógica"]
["25: Prof. Artístico"]
["34: Prof. Tecnológica"]
["43: Prof. Técnico"]
["52: IEST- Técnico"]
["62: ETP-Técnico"]
["71: ETP-Aux. Técnico"]

{"sheet":"Mod02","index":2,"n_rows":152,"n_cols":20,"rows_kept":152,"cut":false,"hidden":false,"merged":[[67,11,69,11],[67,12,69,12],[66,11,66,12],[67,17,69,18],[67,16,69,16],[67,13,69,15],[66,13,66,18],[66,7,69,9],[71,13,71,15],[71,17,71,18],[73,8,73,10],[44,17,44,19],[17,5,17,6],[17,10,18,12],[1,7,1,18],[2,7,2,18],[28,10,28,12],[29,10,29,12],[30,10,30,12],[31,10,31,12],[32,10,32,12],[33,10,33,12],[34,10,34,12],[28,13,28,15],[29,13,29,15],[30,13,30,15],[34,13,34,15],[32,13,32,15],[33,13,33,15],[16,10,16,12],[17,13,18,15],[16,13,16,15],[19,13,19,15],[20,13,20,15],[21,13,21,15],[31,13,31,15],[17,16,18,16],[34,8,34,9],[19,10,19,12],[20,10,20,12],[21,10,21,12],[22,10,22,12],[23,10,23,12],[24,10,24,12],[25,10,25,12],[26,10,26,12],[27,10,27,12],[22,13,22,15],[23,13,23,15],[24,13,24,15],[25,13,25,15],[26,13,26,15],[27,13,27,15],[25,8,25,9],[26,8,26,9],[27,8,27,9],[28,8,28,9],[29,8,29,9],[30,8,30,9],[31,8,31,9],[32,8,32,9],[33,8,33,9],[17,7,18,7],[17,8,18,9],[16,8,16,9],[19,8,19,9],[20,8,20,9],[21,8,21,9],[22,8,22,9],[23,8,23,9],[24,8,24,9],[110,5,111,5],[110,6,111,7],[110,8,112,10],[112,14,112,15],[110,14,111,15],[110,16,111,18],[112,17,112,18],[110,19,112,19],[118,8,118,10],[113,17,113,18],[114,17,114,18],[115,17,115,18],[119,8,119,10],[120,8,120,10],[121,8,121,10],[122,8,122,10],[113,8,113,10],[114,8,114,10],[115,8,115,10],[116,8,116,10],[117,8,117,10],[122,17,122,18],[116,17,116,18],[117,17,117,18],[118,17,118,18],[119,17,119,18],[120,17,120,18],[121,17,121,18],[58,17,58,18],[59,17,59,18],[60,17,60,18],[49,16,50,16],[49,17,50,18],[49,10,50,11],[49,19,50,19],[49,14,50,15],[51,10,51,11],[52,10,52,11],[56,17,56,18],[57,17,57,18],[60,10,60,11],[53,10,53,11],[54,10,54,11],[55,10,55,11],[56,10,56,11],[57,10,57,11],[58,10,58,11],[51,17,51,18],[52,17,52,18],[53,17,53,18],[54,17,54,18],[55,17,55,18],[59,10,59,11],[49,5,50,6],[51,8,51,9],[52,8,52,9],[60,8,60,9],[53,8,53,9],[54,8,54,9],[55,8,55,9],[56,8,56,9],[57,8,57,9],[58,8,58,9],[59,8,59,9],[49,7,50,7],[49,8,50,9]]}
[]
[null,null,null,null,null,null,null,"CENSO EDUCATIVO 2026"]
[null,null,null,null,null,null,null,"LOCAL EDUCATIVO"]
[]
[]
[]
[null,null,null,null,null,"SECCIÓN 3: TERRENO O TERRENOS OCUPADOS POR EL LOCAL EDUCATIVO"]
[]
[null,null,null,null,null,null,"2.3.1. CANTIDAD  DE  TERRENOS  QUE OCUPA ESTE LOCAL EDUCATIVO"]
[]
[]
[null,null,null,null,null,null,"2.3.2. ÁREA TOTAL DEL TERRENO O TERRENOS QUE OCUPA ESTE LOCAL EDUCATIVO:",null,null,null,null,null,null,null,null,null,null,"m2",null,{"$f":"SUM(H20:H35)","v":0}]
[]
[]
["Si-No",null,null,null,null,"2.3.3. SANEAMIENTO FISICO LEGAL DEL TERRENO O TERRENOS QUE OCUPA EL LOCAL EDUCATIVO:"]
["SI"]
["NO",null,null,null,null,null,null,"(1)","(2)",null,"(3)",null,null,"(4)",null,null,"(5)"]
[null,null,null,null,null,"TERRENOS",null,"Área del terreno\n(m2)","Condición de tenencia del terreno",null,"Propietario del terreno",null,null,"El terreno, ¿cuenta con saneamiento Físico Legal?",null,null,"¿Se encuentra inscrito en los Registros Públicos?"]
[]
[1,{"$f":"IF(AND(H20>0,COUNTA(I20:P20)=0),1,0)","v":0},{"$f":"IF(AND($N20=\"SI\",COUNTA(Q20:T20)=0),1,0)","v":0},null,null,{"$f":"IF($A20<=$Q$9,\"Terreno\",\"\")","v":""},{"$f":"IF($A20<=$Q$9,A20,\"\")","v":""}]
[2,{"$f":"IF(AND(H21>0,COUNTA(I21:P21)=0),1,0)","v":0},0,null,null,"",""]
[3,{"$f":"IF(AND(H22>0,COUNTA(I22:P22)=0),1,0)","v":0},0,null,null,"",""]
[4,0,0,null,null,"",""]
[5,0,0,null,null,"",""]
[6,0,0,null,null,"",""]
[7,0,0,null,null,"",""]
[8,0,0,null,null,"",""]
[9,0,0,null,null,"",""]
[10,0,0,null,null,"",""]
[11,0,0,null,null,"",""]
[12,0,0,null,null,"",""]
[13,0,0,null,null,"",""]
[14,0,0,null,null,"",""]
[15,0,0,null,null,"",""]
[]
[]
[]
[null,null,null,null,null,"2.3.4. TOPOGRAFÍA PREDOMINANTE DEL TERRENO O TERRENOS",null,null,null,null,null,null,null,null,"2.3.5. TIPO DE SUELO QUE PREDOMINA EN EL TERRENO O TERRENOS"]
[null,null,null,null,null," QUE OCUPA EL LOCAL EDUCATIVO",null,null,null,null,null,null,null,null,null,"DONDE ESTÁ EDIFICADO EL LOCAL EDUCATIVO"]
[null,null,null,null,null,"Marque con una “X” solo una opción",null,null,null,null,null,null,null,null,null,"Marque con una “X” solo una opción"]
[]
[null,null,null,null,null,null,null,"Llano o plano",null,null,null,null,null,null,null,"","1. Arena"]
["TABLA 01",null,null,null,null,null,null,"Inclinado",null,null,null,null,null,null,null,"","2. Arcilla"]
["01: Propio",null,null,null,null,null,null,"Muy inclinado o desnivelado",null,null,null,null,null,null,null,"","3. Grava"]
["02: Alquilado",null,null,null,null,null,null,"Accidentado, irregular o quebrada",null,null,null,null,null,null,null,null,"4. Otro"]
["03: Prestado"]
["04: Cedido en uso",null,null,null,null,"2.3.6. ¿CON CUÁNTOS TRAMOS CUENTA EL PERÍMETRO DEL ÁREA DEL TERRENO O TERRENOS"]
["05: Otro",null,null,null,null," OCUPADOS POR ESTE LOCAL EDUCATIVO?",null,null,null,null,null,null,null,null,null,null,"Numero de Tramos:"]
[]
["TABLA 02",null,null,null,null,"Número de tramo",null,"Longitud del tramo (mts)","¿se encuentra edificado algún elemento o estructura?",null,"Se encuentra edificada a todo lo largo del tramo del perímetro?",null,null,null,"Número de tramo",null,"Longitud del tramo (mts)","¿se encuentra edificado algún elemento o estructura?",null,"Se encuentra edificada a todo lo largo del tramo del perímetro?"]
["01: Ministerio de Educación"]
["02: Institución Educativa",null,1,null,null,{"$f":"IF($C52<=$T$48,CONCATENATE(\"Tramo - 0\",$C52),\"\")","v":""},null,null,null,null,null,null,null,null,{"$f":"IF((C52+10)<=$T$48,CONCATENATE(\"Tramo - \",(C52+10)),\"\")","v":""}]
["03: Gobierno Nacional",null,2,null,null,"",null,null,null,null,null,null,null,null,{"$f":"IF((C53+10)<=$T$48,CONCATENATE(\"Tramo - \",(C53+10)),\"\")","v":""}]
["04: Gobierno Regional",null,3,null,null,"",null,null,null,null,null,null,null,null,""]
["05: Gobierno Local",null,4,null,null,"",null,null,null,null,null,null,null,null,""]
["06: COFOPRI",null,5,null,null,"",null,null,null,null,null,null,null,null,""]
["07: Com. Campesinas,Nativas",null,6,null,null,"",null,null,null,null,null,null,null,null,""]
["08: Propiedad de Terceros",null,7,null,null,"",null,null,null,null,null,null,null,null,""]
["09: No Especifica",null,8,null,null,"",null,null,null,null,null,null,null,null,""]
["10: Otros",null,9,null,null,"",null,null,null,null,null,null,null,null,""]
[null,null,10,null,null,{"$f":"IF($C61<=$T$48,CONCATENATE(\"Tramo - \",$C61),\"\")","v":""},null,null,null,null,null,null,null,null,""]
[]
[]
[null,null,null,null,null,"SECCIÓN 4: DATOS COMPLEMENTARIOS DEL LOCAL EDUCATIVO"]
["TABLA 03",null,null,null,null,"2.4.1. TOMANDO COMO REFERENCIA LA PUERTA PRINCIPAL, INDIQUE LAS OPCIONES DE ACCESO E INGRESO AL LOCAL EDUCATIVO"]
["01: Const.Posesión Juez de Paz"]
["02: Const.Posesión Municipal",null,null,null,null,null,null,"(1)\n¿Cuáles son las opciones de tipo de acceso al Local Educativo?",null,null,null,"CARACTERÍSTICA DE LA GRADA",null,"CARACTERÍSTICA DE LA RAMPA"]
["03: Res. Municipal",null,null,null,null,null,null,null,null,null,null,"(2)\n ¿La grada cuenta con piso podotáctil al inicio y al final?","(3)\n¿Cuenta con baranda/ pasama-nos?","(4)\n¿El piso de la rampa es homogéneo y antideslizante?",null,null,"(5)\n¿La rampa cuenta con piso podotáctil al inicio y al final?","(6)\n¿Cuenta con baranda/ pasamanos?"]
["04: Res. de Afectación en uso"]
["05: Conv. con Entidad Estatal"]
["06: Conv. con Particulares",null,null,null,null,null,null,"Grada"]
["07: Cont. de Arrendamiento",null,null,null,null,null,null,"Rampa"]
["08: Cont. de Servidumbre",null,null,null,null,null,null,"Directo sin desnivel"]
["09: Otro",null,null,null,null,null,null,"Otro"]
[]
[1,{"$f":"IF(A76<=$Q$9,CONCATENATE(\"TE0\",A76),\"X\")","v":"X"}]
[2,{"$f":"IF(A77<=$Q$9,CONCATENATE(\"TE0\",A77),\"X\")","v":"X"}]
[3,"X"]
[4,"X",null,null,null,null,"2.4.2. EL LOCAL EDUCATIVO, ¿CUENTA CON EL CERTIFICADO DE INSPECCIÓN TÉCNICA DE SEGURIDAD DE EDIFICACIONES (ITSE)?"]
[5,"X"]
[6,"X",null,null,null,null,null,null,null,"Sí","uu","¿Actualmente está vigente?"]
[7,"X",null,null,null,null,null,null,null,null,null,null,null,null,null,null,null,null,null,""]
[8,"X",null,null,null,null,null,null,null,"No",null,null,null,null,"Sí"]
[9,"X"]
[10,{"$f":"IF(A85<=$Q$9,CONCATENATE(\"TE\",A85),\"X\")","v":"X"},null,null,null,null,null,null,null,null,null,null,null,null,"No"]
[11,{"$f":"IF(A86<=$Q$9,CONCATENATE(\"TE\",A86),\"X\")","v":"X"}]
[12,"X"]
[13,"X"]
[14,"X"]
[15,"X"]
[16,"X"]
[17,"X"]
[18,"X"]
[19,"X"]
[20,"X"]
[]
[]
[]
[]
[null,null,null,null,null,"SECCIÓN 5: ACCESIBILIDAD AL LOCAL EDUCATIVO"]
[null,null,null,null,null,"2.5.1. RESPECTO AL TRASLADO QUE REALIZA DESDE SU LOCAL",null,null,null,null,null,null,null,null,"2.5.2. ¿EL LOCAL EDUCATIVO, SE ENCUENTRA UBICADO EN LA CAPITAL"]
[null,null,null,null,null,"EDUCATIVO HASTA LA UGEL DE SU JURISDICCIÓN",null,null,null,null,null,null,null,null,null,"DISTRITAL DONDE SE ENCUENTRA LA SEDE DE LA UGEL?"]
[]
[null,null,null,null,null,"¿Cuántos trayectos tiene la ruta que utiliza habitualmente para trasladarse desde el local",null,null,null,null,null,null,null,null,null,null,"Sí","Pase a capítulo 3"]
[null,null,null,null,null,"educativo hasta la ugel de su jurisdicción, y qué medio de transporte y vía utiliza?"]
[null,null,null,null,null,null,null,null,null,null,null,null,null,null,null,null,"No"]
[null,null,null,null,null,null,null,null,null,null,null,null,null,null,"2.5.3. RESPECTO AL TRASLADO QUE REALIZA DESDE SU LOCAL EDUCATIVO"]
[null,null,null,null,null,null,"N° DE TRAYECTOS:",null,null,null,null,null,null,null,null,"HASTA LA CAPITAL DISTRITAL DONSE SE ENCUENTRA LA UGEL"]
[null,null,null,null,null,null,null,null,null,null,null,null,null,null,null,null,"N° DE TRAYECTOS:"]
[]
[null,null,null,null,null,"Nº de ","Tiempo aproximado del trayecto",null,"Medio de transporte utilizado",null,null,null,null,null,"Nº de ",null,"Tiempo aproximado del trayecto",null,null,"Medio de transporte utilizado"]
[]
[null,null,null,null,null,"Trayecto","Horas","Minutos",null,null,null,null,null,null,"Trayecto",null,"Horas","Minutos"]
[1,null,null,null,null,{"$f":"IF($A114<=$J$108,A114,\"\")","v":""},null,null,null,null,null,null,null,null,{"$f":"IF($A114<=$S$109,A114,\"\")","v":""}]
[2,null,null,null,null,{"$f":"IF($A115<=$J$108,A115,\"\")","v":""},null,null,null,null,null,null,null,null,{"$f":"IF($A115<=$S$109,A115,\"\")","v":""}]
[3,null,null,null,null,{"$f":"IF($A116<=$J$108,A116,\"\")","v":""},null,null,null,null,null,null,null,null,{"$f":"IF($A116<=$S$109,A116,\"\")","v":""}]
[4,null,null,null,null,"",null,null,null,null,null,null,null,null,""]
[5,null,null,null,null,"",null,null,null,null,null,null,null,null,""]
[6,null,null,null,null,"",null,null,null,null,null,null,null,null,""]
[7,null,null,null,null,"",null,null,null,null,null,null,null,null,""]
[8,null,null,null,null,"",null,null,null,null,null,null,null,null,""]
[9,null,null,null,null,"",null,null,null,null,null,null,null,null,""]
[10,null,null,null,null,"",null,null,null,null,null,null,null,null,""]
[]
[]
[]
[]
[]
[]
["TABLA 03"]
["01: Vehicular vía asfaltada"]
["02: Vehicular vía afirmada"]
["03: Vehicular trocha carrozable"]
["04: Peatonal"]
["05: Fluvial"]
["06: Otro"]
[]
["TABLA 03"]
["01: Ladrillo o similar"]
["02: Adobe tapia o quincha"]
["03: Piedra en bloque"]
["04: Madera"]
["05: Alambre"]
["06: Malla metálica"]
["07: Cerco prefabricado"]
["08: Estera"]
["09: Drywall"]
["10: Calaminas"]
["11: Cerco vivo"]
["12: Reja metálica"]
["13: Alucin"]
["14: Otro"]

{"sheet":"Mod03","index":3,"n_rows":237,"n_cols":35,"rows_kept":237,"cut":false,"hidden":false,"merged":[[1,5,1,30],[2,5,2,30],[162,4,164,7],[174,7,174,8],[175,7,175,8],[36,20,36,30],[43,12,43,14],[48,12,48,15],[26,15,28,17],[165,4,165,6],[170,5,170,6],[171,5,173,6],[98,4,98,14],[49,12,49,15],[50,12,50,15],[214,10,214,11],[81,15,83,17],[140,26,140,29],[142,26,142,29],[111,15,113,17],[126,4,126,14],[131,12,131,14],[176,7,176,8],[177,7,177,8],[170,9,170,14],[171,9,173,14],[174,9,174,14],[175,9,175,14],[176,9,176,14],[192,24,192,31],[224,10,224,11],[215,10,215,11],[216,10,216,11],[217,10,217,11],[218,10,218,11],[219,10,219,11],[220,10,220,11],[221,10,221,11],[222,10,222,11],[223,10,223,11],[224,12,224,13],[215,12,215,13],[216,12,216,13],[217,12,217,13],[218,12,218,13],[219,12,219,13],[220,12,220,13],[221,12,221,13],[222,12,222,13],[223,12,223,13],[29,7,29,12],[85,7,85,12],[113,7,113,12],[205,23,205,30],[213,12,213,13],[211,3,212,8],[211,10,211,11],[212,10,212,11],[213,10,213,11],[177,9,177,14],[170,7,170,8],[171,7,173,8],[170,21,170,24],[171,21,173,24],[170,15,170,20],[171,15,173,20],[214,12,214,13],[212,12,212,13],[212,14,212,15],[211,12,211,15],[213,14,213,15],[214,14,214,15],[224,14,224,15],[215,14,215,15],[216,14,216,15],[217,14,217,15],[218,14,218,15],[219,14,219,15],[220,14,220,15],[221,14,221,15],[222,14,222,15],[223,14,223,15],[174,21,174,24],[177,21,177,24],[175,21,175,24],[176,21,176,24],[174,15,174,20],[175,15,175,20],[176,15,176,20],[177,15,177,20]]}
[]
[null,null,null,null,null,"CENSO EDUCATIVO 2026"]
[null,null,null,null,null,"LOCAL EDUCATIVO"]
[]
[]
[null,null,"CAPÍTULO 3: SERVICIOS BÁSICOS"]
[]
[null,null,null,"SECCIÓN 1: SERVICIOS EN EL CENTRO POBLADO"]
[null,null,null,"3.1.1. EL CENTRO POBLADO CUENTA CON SERVICIOS DE:"]
[null,null,null,null,"Para cada una de las alternativas marque con una “X” solo una opción"]
[null,null,null,null,null,null,null,null,null,null,null,null,null,"Sí",null,"No",null,null,null,null,null,null,null,null,null,null,null,null,"Sí",null,"No"]
[null,null,null,null,"1. Agua potable",null,null,null,null,null,null,null,null,null,null,null,null,null,null,"5. Internet"]
[null,null,null,null,"2. Saneamiento (alcantarillado/desagüe)",null,null,null,null,null,null,null,null,null,null,null,null,null,null,"6. Gas"]
[null,null,null,null,"3. Energía eléctrica",null,null,null,null,null,null,null,null,null,null,null,null,null,null,"7. Posta médica o centro de salud"]
[null,null,null,null,"4. Telefonía"]
[]
[]
[null,null,null,"SECCIÓN 1: SERVICIOS BÁSICOS EN EL LOCAL EDUCATIVO"]
[null,null,null,"AGUA POTABLE"]
[null,null,null,"3.1.1. EL ABASTECIMIENTO DE AGUA QUE PREDOMINA EN EL LOCAL",null,null,null,null,null,null,null,null,null,null,null,null,null,null,null,"3.1.2. ¿QUÉ ENTIDAD SUMINISTRA EL SERVICIO DE AGUA POTABLE?"]
[null,null,null,null,"EDUCATIVO, PROVIENE DE:",null,null,null,null,null,null,null,null,null,null,null,null,null,null,null,"Marque con una “X” solo una opción"]
[null,null,null,null,"Marque con una “X” solo una opción"]
[null,null,null,null,null,null,null,null,null,null,null,null,null,null,null,null,null,null,null,null,null,"Empresa Prestadora de Servicios de Saneamiento"]
[null,null,null,null,"","Red pública (agua potable)",null,null,null,null,null,null,null,null,null,null,null,null,null,null,null,"Unidades de Gestión Municipal"]
[null,null,null,null,"","Pilón de uso público (agua potable)",null,null,null,null,null,null,null,null,null,null,null,null,null,null,null,"Operadores especializados"]
[null,null,null,null,"","Camión cisterna u otro similar",null,null,null,null,null,null,null,null,null,null,null,null,null,null,null,"Organizaciones comunales"]
[null,null,null,null,"","Pozo",null,null,null,null,null,null,null,null,null,"Pase a la pregunta 3.1.5"]
[null,null,null,null,"","Sistema de captación de agua de lluvia",null,null,null,null,null,null,null,null,"}"]
[null,null,null,{"$f":"CONCATENATE(E25,E26,E27,E28,E29,E30,E31)","v":""},"","Río, acequia, manantial u otro"]
[null,null,null,{"$f":"CONCATENATE(E27,E28,E29)","v":""},"","Otro",null,""]
[null,null,null,null,null,"No tiene",null,null,"}","Pase a la pregunta 3.1.6"]
[]
[]
[null,null,null,null,null,null,null,null,null,null,null,null,null,null,null,null,null,null,null,"3.2.4. ¿CUÁL ES EL NOMBRE DE LA ENTIDAD QUE SUMINISTRA EL"]
[null,null,null,null,null,null,null,null,null,null,null,null,null,null,null,null,null,null,null,null,"EL SERVICIO DE AGUA POTABLE?"]
[]
[]
[]
[]
[]
[null,null,null,"3.2.5. ¿CON CUÁNTOS SUMINISTROS DE AGUA POTABLE CUENTA EL"]
[null,null,null,null," LOCAL EDUCATIVO?"]
[]
[null,null,null,null,null,null,"Cantidad de suministros"]
[]
[null,null,null,"3.2.6. DETALLE EL(LOS) NÚMERO(S) DE SUMINISTRO(S) DE AGUA POTABLE"]
[null,null,null,null,"CON LOS QUE CUENTA EL LOCAL EDUCATIVO"]
[]
[null,null,null,null,null,null,"Suministro 01"]
[null,null,null,null,null,null,"Suministro 02"]
[null,null,null,null,null,null,"Suministro 03"]
[]
[null,null,null,"3.1.3. EL LOCAL EDUCATIVO, ¿CUENTA CON EL SERVICIO DE AGUA POTABLE",null,null,null,null,null,null,null,null,null,null,null,null,null,null,null,"3.1.4. ¿EL LOCAL EDUCATIVO CUENTA CON BEBEDEROS?"]
[null,null,null,null,"TODOS LOS DÍAS DE LA SEMANA?",null,null,null,null,null,null,null,null,null,null,null,null,null,null,null,"Considere en uso y sin uso"]
[]
[null,null,null,null,null,"Si","}","¿Cuenta con el servicio las 24 horas del día?",null,null,null,null,null,null,null,null,null,null,null,null,null,"Si",null,null,null,null,"No"]
[]
[null,null,null,null,null,null,null,null,null,null,"Si",null,null,null,null,"No"]
[]
[null,null,null,null,null,"No","}","¿Días a la semana que tiene el servicio?",null,null,null,null,null,null,null,null,null,null,null,"Solo si el local educativo se abastece de agua a través de agua de pozo,"]
[null,null,null,null,null,null,null,null,"Marque con una “X” una o más opciones",null,null,null,null,null,null,null,null,null,null,"agua de lluvia, rio, acequia, manantial o similar responda:"]
[null,null,null,null,null,null,null,null,"Lu","Ma","Mi","Ju","Vi","Sá","Do"]
[null,null,null,null,null,null,null,null,null,null,null,null,null,null,null,null,null,null,null,"3.1.5. ¿EL AGUA CAPTADA CUENTA CON UN TRATAMIENTO QUE LA POTABILIZA?"]
[]
[null,null,null,null,null,null,null,null,null,null,null,null,null,null,null,null,null,null,null,null,null,"Si",null,null,null,null,"No"]
[]
[]
[]
[]
[]
[]
[]
[]
[]
[null,null,null,"SANEAMIENTO (ALCANTARILLADO/DESAGÜE)"]
[null,null,null,"3.1.6. EL SANEAMIENTO (ALCANTARILLADO/DESAGÜE) QUE PREDOMINA EN",null,null,null,null,null,null,null,null,null,null,null,null,null,null,null,"3.1.7. EL SERVICIO DE SANEAMIENTO(ALCANTARILLADO/DESAGÜE),"]
[null,null,null,null,"EL LOCAL EDUCATIVO PROVIENE DE:",null,null,null,null,null,null,null,null,null,null,null,null,null,null,null,"¿LO TIENE EN TODOS LOS TERRENOS?"]
[null,null,null,null,"Marque con una “X” solo una opción"]
[null,null,null,null,null,null,null,null,null,null,null,null,null,null,null,null,null,null,null,null,null,"Si"]
[null,null,null,null,"","Red pública",null,null,null,null,null,null,null,null,null,null,null,null,null,null,null,null,null,null,null,null,null,null,null,null,null,{"$f":"'Mod02'!Q9","v":0}]
[null,null,null,null,"","Río, acequia o canal",null,null,null,null,null,null,null,null,null,null,null,null,null,null,null,"No","}","¿En cuántos terrenos los tiene?"]
[null,null,null,null,"","Tanque séptico",null,null,null,null,null,null,null,null,null,"Pase a la pregunta 3.1.8"]
[null,null,null,null,"","Biodigestor",null,null,null,null,null,null,null,null,"}"]
[null,null,null,null,"","Pozo sin tratamiento",null,null,null,null,null,null,null,null,null,null,null,null,null,"Si el local educativo cuenta con algún tipo de saneamiento "]
[null,null,null,null,"","Unidades Básicas de Saneamiento",null,null,null,null,null,null,null,null,null,null,null,null,null,"(alcantarillado/desagüe), responda:"]
[null,null,null,null,"","Otro",null,""]
[null,null,null,null,null,"No tiene",null,null,"}","Pase a la pregunta 3.1.9"]
[null,null,null,null,null,null,null,null,null,null,null,null,null,null,null,null,null,null,null,"3.1.8. ¿EL LOCAL EDUCATIVO CUENTA CON UNA PLANTA DE TRATAMIENTO DE"]
[null,null,null,null,{"$f":"CONCATENATE(E80,E81,E82,E83,E84,E85,E86)","v":""},null,null,null,null,null,null,null,null,null,null,null,null,null,null,null,"AGUAS RESIDUALES PROVENIENTES DE LA ACTIVIDAD HUMANA?"]
[]
[null,null,null,null,null,null,null,null,null,null,null,null,null,null,null,null,null,null,null,null,null,"Si",null,null,null,null,"No"]
[]
[]
[]
[]
[null,null,null,"3.2.14. ¿CUÁL ES EL NOMBRE DE LA ENTIDAD PRESTADORA DEL SERVICIO"]
[null,null,null,null,"DE SANEAMIENTO (ALCANTARILLADO/DESAGÜE)?",null,null,null,null,null,null,null,null,null,null,null,null,null,null,null,null,"Si",null,null,"¿El volumen tratado",null,null,null,null,null,null,"Si"]
[null,null,null,null,null,null,null,null,null,null,null,null,null,null,null,null,null,null,null,null,null,null,null,null,"por día es mayor a"]
[null,null,null,null,null,null,null,null,null,null,null,null,null,null,null,null,null,null,null,null,null,null,null,null,"20 m3 (20 mil litros)?",null,null,null,null,null,null,"No"]
[null,null,null,null,"\u0080",null,null,null,null,null,null,null,null,null,null,null,null,null,null,null,null,"No"]
[null,null,null,null,"Pase a la pregunta 3.2.16"]
[]
[]
[null,null,null,"ENERGÍA ELÉCTRICA"]
[null,null,null,"3.1.9. LA ENERGÍA ELÉCTRICA QUE PREDOMINA EN EL LOCAL EDUCATIVO",null,null,null,null,null,null,null,null,null,null,null,null,null,null,null,"3.1.11. ¿QUÉ TIPO DE SISTEMA ELÉCTRICO TIENE?"]
[null,null,null,null,"PROVIENE DE:"]
[null,null,null,null,null,null,null,null,null,null,null,null,null,null,null,null,null,null,null,null,null,"Monofásico",null,null,null,null,"Trifásico"]
[]
[null,null,null,null,"","Red pública (de una empresa distribuidora de energía eléctrica)",null,null,null,null,null,null,null,null,null,null,null,null,null,"3.1.12. ¿CUENTA CON MEDIDOR DE SUMINISTRO DE ENERGÍA ELÉCTRICA?"]
[null,null,null,null,"","Red pública (terceros)"]
[null,null,null,null,"","Grupo electrógeno",null,null,null,null,null,null,null,null,null,null,null,null,null,null,null,"Si",null,null,null,null,"No"]
[null,null,null,null,"","Paneles solares (energía fotovoltaica)",null,null,null,null,null,null,null,null,null,"Pase a la pregunta 3.1.14"]
[null,null,null,null,"","Energía Eólica",null,null,null,null,null,null,null,null,"}"]
[null,null,null,null,"","Otro",null,"",null,null,null,null,null,null,null,null,null,null,null,"3.1.13. EL LOCAL EDUCATIVO, ¿CUENTA CON EL SERVICIO DE ENERGÍA"]
[null,null,null,null,null,"No tiene",null,null,null,null,null,null,null,null,null,null,null,null,null,null,"ELÉCTRICA TODOS LOS DÍAS DE LA SEMANA?"]
[]
[null,null,null,"3.1.10. EL SERVICIO DE ENERGÍA ELÉCTRICA, ¿LO TIENE EN TODOS",null,null,null,null,null,null,null,null,null,null,null,null,null,null,null,null,null,"Si","}","¿Cuenta con el servicio las 24 horas del día?"]
[null,null,null,null,"LOS TERRENOS?"]
[null,null,null,null,null,null,null,null,null,null,null,null,null,null,null,null,null,null,null,null,null,null,null,null,null,"Si",null,null,null,null,"No"]
[null,null,null,null,null,"Si"]
[null,null,null,null,null,null,null,null,null,null,null,null,null,null,null,{"$f":"'Mod02'!Q9","v":0},null,null,null,null,null,"No","}","¿Días de la semana que tiene el servicio?"]
[null,null,null,null,null,"No","}","¿En cuántos terrenos los tiene?",null,null,null,null,null,null,null,null,null,null,null,null,null,null,null,null,"Lu","Ma","Mi","Ju","Vi","Sá","Do"]
[]
[null,null,null,"3.2.19. ¿CUÁL ES EL NOMBRE DE ENTIDAD PRESTADORA DEL SERVICIO DE"]
[null,null,null,null,"ENERGÍA ELÉCTRICA"]
[]
[]
[]
[null,null,null,"3.2.20. ¿CUÁNTOS SUMINISTROS DE ENERGÍA ELÉCTRICA TIENE EL"]
[null,null,null,null,"LOCAL EDUCATIVO?",null,null,null,null,null,null,null,null,null,null,null,null,null,null,"3.2.25. HORARIO Y TURNO QUE TIENE EL SERVICIO DE ENERGÍA ELÉCTRICA"]
[null,null,null,null,null,null,null,null,null,null,null,null,null,null,null,null,null,null,null,null,"Marque con una “X” solo una opción"]
[null,null,null,null,null,null,"Cantidad de suministros"]
[null,null,null,null,null,null,null,null,null,null,null,null,null,null,null,null,null,null,null,null,null,null,null,null,"Todo el día: ",null,null,null,"Mañana"]
[null,null,null,null,null,null,null,null,null,null,null,null,null,null,null,null,null,null,null,null,null,null,null,null,"Sólo por algunas horas: ",null,null,null,"Tarde"]
[null,null,null,null,null,null,null,null,null,null,null,null,null,null,null,null,null,null,null,null,null,null,null,null,"Sólo durante el horario de clases: ",null,null,null,"Noche"]
[]
[]
["TABLA 01",null,null,"TELEFONÍA FIJA"]
["01: BITEL",null,null,"3.1.14. EL LOCAL EDUCATIVO ¿CUENTA CON LÍNEA DE TELEFONÍA FIJA?",null,null,null,null,null,null,null,null,null,null,null,null,null,null,null,"3.1.15. REGISTRE EL NÚMERO DE TELÉFONO FIJO DEL LOCAL EDUCATIVO"]
["02: CLARO"]
["03: ENTEL",null,null,null,null,"Sí",null,null,null,"No",null,"Pase a la pregunta 3.1.16",null,null,null,null,null,null,null,null,null,"Prefijo :",null,null,null,null,""]
["04: MOVISTAR"]
["05: OTRO",null,null,null,null,null,null,null,null,null,null,null,null,null,null,null,null,null,null,null,null,"Nro. de teléfono fijo:",null,null,null,null,""]
[null,null,null,null,"¿FUNCIONA?",null,null,null,"Sí",null,"","No",null,"Pase a la pregunta 3.1.16"]
[]
["SI - NO",null,null,"3.2.27. LA LÍNEA DE TELEFONÍA FIJA CON LA QUE CUENTA EL LOCAL"]
["SI",null,null,null,"EDUCATIVO, ¿FUNCIONA DURANTE EL HORARIO DE CLASE?"]
["NO"]
[null,null,null,null,null,"Sí",null,null,null,"No"]
[]
[]
[]
[]
[]
[]
[]
["TABLA 01",null,null,"INTERNET"]
["01: ADSL-P (Cable telefónico)",null,null,"3.1.16. EL LOCAL EDUCATIVO, ¿CUENTA CON SERVICIO DE INTERNET? (*)"]
["02: FTTH (Fibra óptica)",null,null,null,null,null,null,null,null,null,null,null,null,"Responda lo siguiente y luego pase a Gas:"]
["03: HFC (Híbrido de fibra+coaxial)",null,null,null,null,"Sí",null,null,null,"No"]
["04: CABLE (Cable coaxial)",null,null,null,null,null,null,null,null,null,null,null,null,"El director y/o los docentes, para sus funciones pedagógicas,"]
["05: INTERNET SATELITAL",null,null,null,null,null,null,null,null,null,null,null,null,"¿acceden regularmente a internet dentro del local educativo",null,null,null,null,null,null,null,null,null,null,null,null,"}",null,"Sí",null,null,"No"]
["06: RED INALÁMBRICA WIFI",null,null,null,"¿Cuántas líneas de internet tiene?",null,null,null,null,null,null,null,null,"desde sus propios equipos electrónicos (plan de datos)?"]
["07: INTERNET PORTATIL / USB MODEM"]
["08: RED INALÁMBRICA RADIOENLACE",null,null,null,null,null,null,null,null,null,null,null,null,"Los estudiantes, para sus labores académicas, ¿acceden a"]
["09: OTRO",null,null,null,null,null,null,null,null,null,null,null,null,"internet desde tablets con plan de datos (chip) adquiridas o",null,null,null,null,null,null,null,null,null,null,null,null,"}",null,"Sí",null,null,"No"]
[null,null,null,null,null,null,null,null,null,null,null,null,null,"dotadas al local educativo?"]
["TABLA 02"]
["01: MOVISTAR"]
["02: CLARO",null,null,null,"INFORMACIÓN DE LAS LÍNEAS DE INTERNET CON LAS QUE CUENTA EL LOCAL EDUCATIVO"]
["03: ENTEL",null,null,null,null,"(1)",null,"(2)",null,"(3)",null,null,null,null,null,"(4)",null,null,null,null,null,"(5)"]
["04: BITEL",null,null,null,"Nro","Nº de línea",null,"La línea se encuentra activa?",null,"Tipo de medio de transmisión (conexión)",null,null,null,null,null,"Entidad que financia el servicio",null,null,null,null,null,"¿El servicio de Internet cuenta con filtros de contenido web?"]
["05: VSAT/MINEDU"]
["06: LEVEL 3 IT SOLUTIONS S.A.C."]
["07: WIN",null,"Linea 01",null,1,{"$f":"IF($E175<=$E$166,C175,\"\")","v":""}]
["08: SENCINET LATAM PERU S.A.C.",null,"Linea 02",null,2,{"$f":"IF($E176<=$E$166,C176,\"\")","v":""}]
["09: OTRO",null,"Línea 03",null,3,{"$f":"IF($E177<=$E$166,C177,\"\")","v":""}]
[null,null,"Linea 04",null,4,{"$f":"IF($E178<=$E$166,C178,\"\")","v":""}]
["TABLA 03"]
["01: MINEDU"]
["02: UNID.EJECUTORA/UGEL/DRE",null,null,"GAS"]
["03: GOB. REGIONAL",null,null,"3.1.17. EL LOCAL EDUCATIVO, ¿CUENTA CON INSTALACIÓN DEL SERVICIO DE",null,null,null,null,null,null,null,null,null,null,null,null,null,null,null,"3.1.18. ¿TIPO DE GAS?"]
["04: GOB. LOCAL/MUNICIPAL",null,null,null,"GAS (NATURAL O GLP POR BALON)?",null,null,null,null,null,null,null,null,null,null,null,null,null,null,null,null,null,null,null,null,null,null,null,null,null,null,null,null,null," "]
["05: MTC (CONCESIÓN/CONVENIO)",null,null,null,null,null,null,null,null,null,null,null,null,null,null,null,null,null,null,null,"","GLP (gas licuado de petróleo)",null,null,null,null,null,null,null,"GN (gas natural)"]
["06: COMUNIDAD",null,null,null,null,"Sí",null,null,null,"No",null,"Pase a la pregunta 3.1.19"]
["07: RECURSOS PROPIOS DE LA IE"]
["08: APAFA"]
["09: PERSONAL DE LA IE.",null,null,null,"¿FUNCIONA?",null,null,null,"Sí",null,null,"No",null,"Pase a la pregunta 3.1.19"]
["10: EMPRESA PRIVADA"]
["11: OTRO",null,null,"3.2.32. EL SERVICIO DE GAS CON EL QUE CUENTA EL LOCAL EDUCATIVO, ",null,null,null,null,null,null,null,null,null,null,null,null,null,null,null,"3.2.35. NOMBRE DE EMPRESA CONCESIONARIA / ADMINISTRADORA DEL"]
[null,null,null,null,"¿FUNCIONA DURANTE EL HORARIO DE CLASE?",null,null,null,null,null,null,null,null,null,null,null,null,null,null,null,"SERVICIO DE GAS"]
[]
[null,null,null,null,null,"Sí",null,null,null,null,null,"No",null,null,null,null,null,null,null,null,null,null,null,null,""]
[]
[]
["Prefijos",null,null,"OTROS SERVICIOS"]
["01: Lima y Callao",null,null,"3.1.19. EL LOCAL EDUCATIVO ¿CUENTA CON MÓDULO DE CONECTIVIDAD?",null,null,null,null,null,null,null,null,null,null,null,null,null,null,null,"3.1.21. SOBRE LA ELIMINACIÓN DE LA BASURA, MARQUE LAS ALTERNATIVAS"]
["41: Amazonas",null,null,null,null,null,null,null,null,null,null,null,null,null,null,null,null,null,null,null,"QUE MÁS SE AJUSTEN A LA REALIDAD"]
["43: Ancash",null,null,null,null,"Sí",null,null,null,null,null,"No",null,null,null,null,null,null,null,null,"Marque con una “X” una o más opciones"]
["83: Apurimac"]
["54: Arequipa",null,null,"3.1.20. EL LOCAL EDUCATIVO, ¿CUENTA CON UN TÓPICO PARA ATENCIÓN DE",null,null,null,null,null,null,null,null,null,null,null,null,null,null,null,null,"","La arrojan al camión o triciclo municipal."]
["66: Ayacucho",null,null,null,"PRIMEROS AUXILIOS?",null,null,null,null,null,null,null,null,null,null,null,null,null,null,null,"","La arrojan al camión o triciclo informal"]
["76: Cajamarca",null,null,null,null,null,null,null,null,null,null,null,null,null,null,null,null,null,null,null,"","La entierran"]
["84: Cusco",null,null,null,null,"Si",null,null,"El tópico, ¿se encuentra",null,null,null,null,null,null,"Si",null,null,null,null,"","La queman"]
["67: Huancavelica",null,null,null,null,null,null,null," implementado?",null,null,null,null,null,null,null,null,null,null,null,"","La arrojan a cualquier lugar"]
["62: Huanuco",null,null,null,null,null,null,null,null,null,null,null,null,null,null,"No",null,null,null,null,"","Otro",null,""]
["56: Ica",null,null,null,null,"No"]
["64: Junín"]
["44: La Libertad"]
["74: Lambayeque",null,null,"OTROS ELEMENTOS"]
["65: Loreto",null,null,"3.1.22 OTROS ELEMENTOS EN EL LOCAL EDUCATIVO:"]
["82: Madre de Dios",null,null,"(1)\nOtros elementos",null,null,null,null,null,null,"(2)",null,"(3)\n¿Cuántos tiene?"]
["53: Moquegua",null,null,null,null,null,null,null,null,{"$f":"COUNTIF(K214:K225,\"SI\")+COUNTIF(K214:K225,\"NO\")","v":0},"¿Tiene?",null,"Total",null,"En uso"]
["63: Pasco",null,null,1,"TANQUE ELEVADO DE AGUA"]
["73: Piura",null,null,2,"TANQUE CISTERNA DE AGUA"]
["51: Puno",null,null,3,"BOMBA SUMERGIBLE"]
["42: San Martín",null,null,4,"TANQUE SÉPTICO"]
["52: Tacna",null,null,5,"BIODIGESTOR"]
["72: Tumbes",null,null,6,"PARARRAYOS"]
["61: Ucayali",null,null,7,"SISTEMAS DE PANELES SOLARES"]
[null,null,null,8,"POZOS A TIERRA"]
[{"$f":"IF(AND(K214=\"SI\",M214=0),1,0)","v":0},null,null,9,"CÁMARAS DE VIDEOVIGILANCIA"]
[{"$f":"IF(AND(K215=\"SI\",M215=0),1,0)","v":0},null,null,10,"MONITORES DE VIDEOVIGILANCIA"]
[0,null,null,11,"GRUPO ELECTRÓGENO"]
[0,null,null,12,"SISTEMA CALENTADOR DE AGUA"]
[0]
[0]
[0]
[0]
[0]
[0]
[0]
[0]
[]
[]
["01: Concreto armado"]
["02: Plástico fibra …"]

{"sheet":"Mod04","index":4,"n_rows":118,"n_cols":13,"rows_kept":118,"cut":false,"hidden":false,"merged":[[11,10,12,11],[16,7,16,9],[16,10,16,12],[1,8,1,15],[2,8,2,15]]}
[]
[null,null,null,null,null,null,null,null,"CENSO EDUCATIVO 2026"]
[null,null,null,null,null,null,null,null,"LOCAL EDUCATIVO"]
[]
[]
[null,null,null,null,null,"CAPÍTULO 4: INFORMACIÓN GENERAL DEL CERCO PERIMÉTRICO Y MUROS EN EL LOCAL EDUCATIVO"]
[]
[null,null,null,null,null,null,"4.1. EL PERÍMETRO DEL LOCAL EDUCATIVO, ¿CUENTA CON CERCO PERIMÉTRICO?",null,null,null,null,null,"4.2. ¿CUÁNTOS TRAMOS TIENE EL CERCO PERIMÉTRICO DEL LOCAL EDUCATIVO?"]
[]
[null,null,null,null,null,null,null,"Sí, total",null,""]
[null,null,null,null,null,null,null,"Sí, parcial",null,null,null,null,"Número de tramos del cerco perimétrico"]
[null,null,null,null,null,null,null,"No tiene pero lo requiere",null,null,"Pase a pregunta 5.1"]
[null,null,null,null,null,null,null,"No tiene y no requiere"]
[null,null,null,null,null,null,{"$f":"CONCATENATE(G10,G11)","v":""}]
[]
[null,null,null,null,null,null,"4.3. COMPLETE INFORMACIÓN POR CADA TRAMO DEL CERCO PERÍMETRICO DEL LOCAL EDUCATIVO"]
[null,null,null,null,null,null,null,"CARACTERÍSTICAS DEL CERCO PERIMÉTRICO",null,null,"CARACTERÍSTICAS DEL MURO DE CONTENCIÓN"]
[null,null,null,null,null,null,"(1)","(2)","(3)","(4)","(5)","(6)","(7)"]
[null,null,null,null,null,"Nº","Nº de Tramo","Longitud del cerco perimétrico\n(m)","¿Tiene acceso al local educativo?","¿Tiene\nportón?","¿Tiene muro de contención?","¿Forma parte del cerco perimétrico?","Estado de\nconservación"]
["Si-No",1,null,null,null,{"$f":"IF(B20<=$Q$11,CONCATENATE(B20),\"\")","v":""},{"$f":"IF(B20<=$Q$11,CONCATENATE(\"T0\",B20),\"\")","v":""}]
["SI",2,null,null,null,{"$f":"IF(B21<=$Q$11,CONCATENATE(B21),\"\")","v":""},""]
["NO",3,null,null,null,"",""]
[null,4,null,null,null,"",""]
[null,5,null,null,null,"",""]
[null,6,null,null,null,{"$f":"IF(B25<=$Q$11,CONCATENATE(B25),\"\")","v":""},{"$f":"IF(B25<=$Q$11,CONCATENATE(\"T0\",B25),\"\")","v":""}]
[null,7,null,null,null,"",{"$f":"IF(B26<=$Q$11,CONCATENATE(\"T0\",B26),\"\")","v":""}]
[null,8,null,null,null,"",{"$f":"IF(B27<=$Q$11,CONCATENATE(\"T0\",B27),\"\")","v":""}]
[null,9,null,null,null,"",{"$f":"IF(B28<=$Q$11,CONCATENATE(\"T0\",B28),\"\")","v":""}]
[null,10,null,null,null,"",{"$f":"IF(B29<=$Q$11,CONCATENATE(\"T\",B29),\"\")","v":""}]
[null,11,null,null,null,"",""]
[null,12,null,null,null,"",""]
[null,13,null,null,null,"",""]
[null,14,null,null,null,"",""]
[null,15,null,null,null,"",""]
[null,16,null,null,null,"",""]
[null,17,null,null,null,"",""]
[null,18,null,null,null,"",""]
[null,19,null,null,null,"",""]
[null,20,null,null,null,"",""]
[null,21,null,null,null,"",""]
[null,22,null,null,null,"",""]
[null,23,null,null,null,"",""]
[null,24,null,null,null,"",""]
[null,25,null,null,null,"",""]
[null,26,null,null,null,"",""]
[null,27,null,null,null,"",{"$f":"IF(B46<=$Q$11,CONCATENATE(\"T\",B46),\"\")","v":""}]
[]
[]
[]
["TABLA 01"]
["01: Frente"]
["02: Derecho"]
["03: Fondo"]
["04: Izquierdo"]
[""]
["TABLA 02"]
["01: Ladrillo/similar/bloque ..."]
["02: Adobe/tapia/quincha piedra ..."]
["03: Piedra en bloque"]
["04: Madera"]
["05: Alambre"]
["06: Malla metálica"]
["07: Cerco prefabricado"]
["08: Estera"]
["09: Drywall"]
["10: Calaminas"]
["11: Cerco vivo"]
["12: Reja metálica"]
["13: Alucin "]
["14: Otro"]
[]
["TABLA 09"]
["01: Sin daño"]
["02: Fisuras leves"]
["03: Fisuras moderadas …"]
["04: Agrietamiento ó colapso"]
["TABLA 03"]
["01: Bueno"]
["02: Regular"]
["03: Mal Estado"]
[]
["TABLA 04"]
["01: Gob. nacional"]
["02: Gob. regional"]
["03: APAFA"]
["04: Ent. cooperantes"]
["05: Empresa privada"]
["06: Otro"]
[]
["TABLA 05"]
["01: Acceso plano"]
["02: Escalera y rampa"]
["03: Sólo rampa"]
[""]
["TABLA 06"]
["01: Concreto armado"]
["02: Metálico"]
["03: Concreto simple"]
["04: Madera"]
["05: Piedra"]
["06: Otro"]
[]
["TABLA 07"]
["01: Madera"]
["02: Mallas metálicas"]
["03: Rejas metálicas"]
["04: Planchas metálicas"]
["05: Drywall"]
["06: Otro"]
[]
["TABLA 08"]
["01: Concreto reforzado"]
["02: Concreto simple"]
["03: Concreto ciclópeo"]
["04: Concreto ciclópeo con  ..."]
["05: Mamposteria o bloques ..."]
["06: Muros de gravedad flexible"]
["07: Otro"]

{"sheet":"Mod05","index":5,"n_rows":138,"n_cols":30,"rows_kept":138,"cut":false,"hidden":false,"merged":[[15,17,15,25],[17,24,20,24],[17,25,20,25],[16,24,16,25],[18,28,19,28],[16,23,20,23],[15,26,15,29],[18,26,19,26],[16,26,16,29],[16,21,19,21],[16,22,19,22],[18,27,20,27],[18,29,19,29],[1,8,1,17],[2,8,2,17],[17,20,20,20],[16,12,20,12],[16,14,16,16],[18,13,19,13],[18,14,19,14],[18,15,19,15],[18,16,19,16],[18,18,19,18],[18,17,20,17],[18,19,19,19],[15,6,15,16],[16,17,16,20],[16,10,17,10],[16,13,17,13],[16,6,19,6],[16,7,19,7],[16,8,19,8],[16,9,19,9],[16,11,19,11],[18,10,20,10]]}
[]
[null,null,null,null,null,null,null,null,"CENSO EDUCATIVO 2026"]
[null,null,null,null,null,null,null,null,"LOCAL EDUCATIVO"]
[]
[]
[]
[null,null,null,null,null,"CAPÍTULO 5: INFORMACIÓN ESPECÍFICA POR EDIFICACIÓN EN EL LOCAL EDUCATIVO"]
[]
[]
[null,null,null,null,null,null,null,null,null,"5.1. ¿CUÁNTAS EDIFICACIONES TIENE EL LOCAL EDUCATIVO?"]
[]
[null,null,null,null,null,null,null,null,null,null,null,null,null,null,null,null,{"$f":"SUM(M22:M122)","v":0}]
[null,null,null,null,null,null,null,null,null,"5.2. ÁREA TECHADA TOTAL:",null,null,null,null,null,null,null,"m2"]
[null,null,null,null,null,null,null,null,null,null,null,null,null,null,null,"Enteros",".     Decimal"]
[null,null,null,null,null,"5.3 EDIFICACIÓNES EN EL LOCAL EDUCATIVO"]
[null,null,null,null,null,null,"CARACTERÍSTICAS DE LAS EDIFICACIONES",null,null,null,null,null,null,null,null,null,null,"ESTADO DE CONSERVACIÓN DE LAS EDIFICACIONES",null,null,null,null,null,null,null,null,"EQUIPOS DE SEGURIDAD EN EDIFICACIONES"]
[null,null,null,null,null,null,"(1)\n\nNº de Edifica- ción","(2)\n\n¿En qué\nterreno se encuentra la edificación?","(3)\n\nLa\nedificación\nestá en uso\nactual- mente?","(4)\n\n¿La edificación\nes un módulo\nprefabri- cado?","(5)\nSi registró “SI” en el numeral (4),\ncomplete:","(6)\n\nNro.\nde pisos\nde la\nedificación","(7)\n\nÁrea techada\nde la\nedificación (m2)\n\n(Sumar área techada de\ntodos los pisos)","(8)\n\nDatos de construcción\nde la edificación","(9)\nLa edificación cuenta con RED INTERNA de:",null,null,"(10)\nFormas de acceso a cada edificación",null,null,null,"(11)\n\n¿Cómo se conectan los espacios interiores en un mismo piso?","(12)\n\n¿Cómo se conectan esta  edificación\ncon otra\nedificación?","(13)\n\nLa edificación ¿Se encuentra en riesgo de colapso o presenta riesgo estructural?","Sólo si seleccionó “Sí” en el numeral “13”",null,"(16)\nLa edificación cuenta con:"]
[null,null,null,null,null,"Nº",null,null,null,null,null,null,null,null,"(1)","(2)","(3)","(1)","(2)","(3)","(4)\n\n¿Tiene\nascensor?",null,null,null,"(14)\n¿Cuenta con un informe o certificado que diagnostique esta situación?","(15)\n\nEntidad que elabora el informe","(1)\n\nSeñalización de seguridad","(2)\n\nSistemas de detección y alarma contra incendio","(3)\n\nBotiquín debida- mente equipado","(4)\n\nLuces de emergencia operativas"]
[null,null,null,null,null,null,null,null,null,null,"¿Cuál es la finalidad del uso del módulo\nprefabricado?",null,null,"Tipo\nde entidad\nejecutora","Agua","Alcantari- llado/ desagüe","Energia Eléctrica","¿Tiene acceso directo sin desnivel?","¿Tiene rampa de acceso?","¿Tiene escalera?",null,null,null,null,null,null,"Señalización de seguridad","Sistemas de detección y alarma contra incendio","Botiquín debidamente equipado","Luces de emergencia operativas"]
[]
[null,null,null,null,null,null,null,null,null,null,null,null,null,null,null,null,null,null,"Primer piso"]
["SI / NO",1,{"$f":"IF(AND(J22=\"SI\",COUNTA(K22:M22)=0),1,IF(AND(J22=\"NO\",COUNTA(K22:M22)>0),1,0))","v":0},{"$f":"IF(F22<>\"\",1,0)","v":0},null,{"$f":"IF(B22<=$Q$10,CONCATENATE(B22),\"\")","v":""},{"$f":"IF(B22<=$Q$10,CONCATENATE(\"E0\",B22),\"\")","v":""}]
["SI",2,0,{"$f":"IF(F23<>\"\",1,0)","v":0},null,"",""]
["NO",3,0,{"$f":"IF(F24<>\"\",1,0)","v":0},null,"",""]
["No aplica",4,0,{"$f":"IF(F25<>\"\",1,0)","v":0},null,"",""]
["TABLA 01",5,0,{"$f":"IF(F26<>\"\",1,0)","v":0},null,"",""]
["01: Emergencia",6,0,{"$f":"IF(F27<>\"\",1,0)","v":0},null,"",""]
["02: Temporal",7,0,0,null,"",""]
["03: Permanente",8,0,0,null,"",""]
[null,9,0,0,null,"",""]
["TABLA 02",10,0,0,null,"",{"$f":"IF(B31<=$Q$10,CONCATENATE(\"E\",B31),\"\")","v":""}]
["01: Gob. nacional",11,0,0,null,"",""]
["02: Gob. regional",12,0,0,null,"",""]
["03: Gob. Local",13,0,0,null,"",""]
["04: APAFA",14,0,0,null,"",""]
["05: Ent. cooperantes",15,0,0,null,"",""]
["06: Empresa privada",16,0,0,null,"",""]
["07: No especifica",17,0,{"$f":"IF(F38<>\"\",1,0)","v":0},null,"",""]
["TABLA XX",18,0,{"$f":"IF(F39<>\"\",1,0)","v":0},null,"",""]
["01: Rectangular o cuadrado",19,0,{"$f":"IF(F40<>\"\",1,0)","v":0},null,"",""]
["02: Hexagonal u octogonal",20,0,{"$f":"IF(F41<>\"\",1,0)","v":0},null,"",""]
["03: Irregular",21,0,{"$f":"IF(F42<>\"\",1,0)","v":0},null,"",""]
[null,22,0,0,null,"",""]
["TABLA 03",23,0,0,null,"",""]
["01: Concreto armado",24,0,0,null,"",""]
["02: Albañilería confinada",25,0,0,null,"",""]
["03: Albañilería sin confinar",26,0,0,null,"",""]
["04: Adobe / tapial",27,0,0,null,"",""]
["05: Madera estructural",28,0,0,null,"",""]
["06: Acero estructural",29,0,0,null,"",""]
["07: Módulo prefabricado PRONIED",30,0,0,null,"",""]
["08: Módulo prefabricado-Otro",31,0,0,null,"",""]
["09: Precario",32,0,0,null,"",""]
["10: Otro",33,{"$f":"IF(AND(J54=\"SI\",COUNTA(K54:M54)=0),1,IF(AND(J54=\"NO\",COUNTA(K54:M54)>0),1,0))","v":0},0,null,{"$f":"IF(B54<=$Q$10,CONCATENATE(B54),\"\")","v":""},""]
["11: No tiene pero requiere",34,0,0,null,"",""]
["12: No tiene y no lo requiere",35,0,0,null,"",""]
[null,36,0,0,null,"",""]
["TABLA 05",37,0,0,null,"",""]
["01: Concreto ",38,0,0,null,"",""]
["02: Madera",39,0,0,null,"",""]
["03: Teja",40,0,0,null,"",""]
["04: Fibra de cemento",41,0,0,null,"",""]
["05: Calamina",42,0,0,null,"",{"$f":"IF(B63<=$Q$10,CONCATENATE(\"E\",B63),\"\")","v":""}]
["06: Calaminon",43,0,0,null,"",""]
["07: Caña con barro",44,0,0,null,"",""]
["08: Lata o latón",45,0,0,null,"",""]
["09: Otro",46,0,0,null,"",""]
["10: No tiene pero requiere",47,0,0,null,"",""]
["11: No tiene y no lo requiere",48,0,0,null,"",""]
[null,49,0,0,null,"",""]
[null,50,0,0,null,"",""]
["01: Bueno",51,0,0,null,"",""]
["02: Regular",52,0,0,null,"",""]
["03: Mal estado",53,0,0,null,"",""]
["04: No aplica",54,0,0,null,"",""]
[null,55,0,0,null,"",""]
[{"$f":"'Mod02'!B76","v":"X"},56,0,0,null,"",""]
[{"$f":"'Mod02'!B77","v":"X"},57,0,0,null,"",""]
[{"$f":"'Mod02'!B78","v":"X"},58,0,0,null,"",""]
[{"$f":"'Mod02'!B79","v":"X"},59,0,0,null,"",""]
[{"$f":"'Mod02'!B80","v":"X"},60,0,0,null,"",""]
[{"$f":"'Mod02'!B81","v":"X"},61,0,0,null,"",""]
[{"$f":"'Mod02'!B82","v":"X"},62,0,0,null,"",""]
[{"$f":"'Mod02'!B83","v":"X"},63,0,0,null,"",""]
[{"$f":"'Mod02'!B84","v":"X"},64,0,0,null,"",""]
[{"$f":"'Mod02'!B85","v":"X"},65,{"$f":"IF(AND(J86=\"SI\",COUNTA(K86:M86)=0),1,IF(AND(J86=\"NO\",COUNTA(K86:M86)>0),1,0))","v":0},0,null,{"$f":"IF(B86<=$Q$10,CONCATENATE(B86),\"\")","v":""},""]
[{"$f":"'Mod02'!B86","v":"X"},66,0,0,null,"",""]
[{"$f":"'Mod02'!B87","v":"X"},67,0,0,null,"",""]
[{"$f":"'Mod02'!B88","v":"X"},68,0,0,null,"",""]
[{"$f":"'Mod02'!B89","v":"X"},69,0,0,null,"",""]
[{"$f":"'Mod02'!B90","v":"X"},70,0,0,null,"",""]
[{"$f":"'Mod02'!B91","v":"X"},71,0,0,null,"",""]
[{"$f":"'Mod02'!B92","v":"X"},72,0,0,null,"",""]
[{"$f":"'Mod02'!B93","v":"X"},73,0,0,null,"",""]
[{"$f":"'Mod02'!B94","v":"X"},74,0,0,null,"",{"$f":"IF(B95<=$Q$10,CONCATENATE(\"E\",B95),\"\")","v":""}]
[{"$f":"'Mod02'!B95","v":"X"},75,0,0,null,"",""]
[null,76,0,0,null,"",""]
[null,77,0,0,null,"",""]
[null,78,0,0,null,"",""]
[null,79,0,0,null,"",""]
[null,80,0,0,null,"",""]
[null,81,0,0,null,"",""]
[null,82,0,0,null,"",""]
[null,83,0,0,null,"",""]
[null,84,0,0,null,"",""]
[null,85,0,{"$f":"IF(F106<>\"\",1,0)","v":0},null,"",""]
[null,86,0,0,null,"",""]
[null,87,0,0,null,"",""]
[null,88,0,0,null,"",""]
[null,89,0,0,null,"",""]
[null,90,0,0,null,"",""]
[null,91,0,0,null,"",""]
[null,92,0,0,null,"",""]
[null,93,0,0,null,"",""]
[null,94,0,0,null,"",""]
[null,95,0,0,null,"",""]
[null,96,0,0,null,"",""]
[null,97,0,0,null,"",""]
[null,98,0,0,null,"",""]
[null,99,0,0,null,"",""]
[null,100,0,0,null,"",""]
["TABLA 06",null,null,null,null,""]
["01: Directo",null,null,null,null,null,null,"---","---","---","---","---","---","---","---","---","---","---","---","---","---","---",null,"---","---","---","---","---","---","---"]
["02: Gradas"]
["03: Rampas"]
["04: Otros"]
[]
["TABLA 07"]
["01: Circuito canalizado"]
["02: Circuito sin canalizar"]
["03: No especifica"]
[]
[]
["TABLA 08"]
["01: CENEPRED"]
["02: GOBIERNO LOCAL"]
["03: PRONIED"]
["04: OTROS"]

{"sheet":"Mod06","index":6,"n_rows":328,"n_cols":76,"rows_kept":328,"cut":false,"hidden":false,"merged":[[11,56,11,65],[12,56,13,56],[12,61,12,65],[12,58,13,58],[12,59,13,59],[13,62,13,64],[13,65,14,65],[12,17,13,17],[13,55,14,55],[13,61,14,61],[12,57,13,57],[13,14,14,14],[13,15,14,15],[13,16,14,16],[13,52,14,52],[13,49,14,49],[13,50,14,50],[13,47,14,47],[13,51,14,51],[13,48,14,48],[13,45,14,45],[13,46,14,46],[13,18,13,26],[2,18,2,31],[1,18,1,31],[11,53,11,54],[12,53,12,54],[13,53,14,53],[13,54,14,54],[12,18,12,44],[11,49,11,50],[12,49,12,50],[11,51,11,52],[12,51,12,52],[13,36,13,44],[14,19,14,24],[14,28,14,33],[14,37,14,42],[13,27,13,35]]}
[null,null,null,null,null,null,null,null,null,null,{"$f":"IF('S100'!Z61<>\"\",'S100'!Z61,\"X\")","v":"X"},{"$f":"IF('Mod05'!G22<>\"\",'Mod05'!G22,\"X\")","v":"X"}]
[null,null,null,null,null,null,null,null,null,null,{"$f":"IF('S100'!Z62<>\"\",'S100'!Z62,\"X\")","v":"X"},{"$f":"IF('Mod05'!G23<>\"\",'Mod05'!G23,\"X\")","v":"X"},null,null,null,null,null,null,"CENSO EDUCATIVO 2026"]
[null,null,null,null,null,null,null,null,null,null,{"$f":"IF('S100'!Z63<>\"\",'S100'!Z63,\"X\")","v":"X"},{"$f":"IF('Mod05'!G24<>\"\",'Mod05'!G24,\"X\")","v":"X"},null,null,null,null,null,null,"LOCAL EDUCATIVO"]
[null,null,null,null,null,null,null,null,null,null,{"$f":"IF('S100'!Z64<>\"\",'S100'!Z64,\"X\")","v":"X"},{"$f":"IF('Mod05'!G25<>\"\",'Mod05'!G25,\"X\")","v":"X"}]
[null,null,null,null,null,null,null,null,null,null,{"$f":"IF('S100'!Z65<>\"\",'S100'!Z65,\"X\")","v":"X"},{"$f":"IF('Mod05'!G26<>\"\",'Mod05'!G26,\"X\")","v":"X"}]
[null,null,null,null,null,null,null,null,null,null,{"$f":"IF('S100'!Z66<>\"\",'S100'!Z66,\"X\")","v":"X"},{"$f":"IF('Mod05'!G27<>\"\",'Mod05'!G27,\"X\")","v":"X"},null,"CAPÍTULO 6: CARACTERÍSTICAS DE LAS AULAS O AMBIENTES ACONDICIONADOS COMO AULAS EN EL LOCAL EDUCATIVO"]
[null,null,null,null,null,null,null,null,null,null,{"$f":"IF('S100'!Z67<>\"\",'S100'!Z67,\"X\")","v":"X"},{"$f":"IF('Mod05'!G28<>\"\",'Mod05'!G28,\"X\")","v":"X"}]
["GESTIÓN",{"$f":"'S100'!B60","v":9},null,null,null,null,null,null,null,null,{"$f":"IF('S100'!Z68<>\"\",'S100'!Z68,\"X\")","v":"X"},{"$f":"IF('Mod05'!G29<>\"\",'Mod05'!G29,\"X\")","v":"X"},null,null,null,null,"6.1. NÚMERO DE AULAS O AMBIENTES ACONDICIONADOS COMO AULAS:",null,null,null,null,null,null,null,null,"TOTAL",null,"BUENO",null,null,null,null,null,null,"REGULAR","MALO"]
[null,null,null,null,null,null,null,null,null,null,{"$f":"IF('S100'!Z69<>\"\",'S100'!Z69,\"X\")","v":"X"},{"$f":"IF('Mod05'!G30<>\"\",'Mod05'!G30,\"X\")","v":"X"},null,null,null,null,"Considere a las aulas o espacios EN USO y SIN USO",null,null,null,null,null,null,null,null,{"$f":"AB9+AI9+AJ9","v":0}]
[null,null,null,null,null,null,null,null,null,null,{"$f":"IF('S100'!Z70<>\"\",'S100'!Z70,\"X\")","v":"X"},{"$f":"IF('Mod05'!G31<>\"\",'Mod05'!G31,\"X\")","v":"X"}]
["Turno mañana",null,null,null,null,null,null,null,null,null,{"$f":"IF('S100'!Z71<>\"\",'S100'!Z71,\"X\")","v":"X"},{"$f":"IF('Mod05'!G32<>\"\",'Mod05'!G32,\"X\")","v":"X"},null,"Registre en cada fila de la tabla las características de cada aula en uso y sin uso."]
["Turno tarde",null,null,null,null,null,null,null,null,null,{"$f":"IF('S100'!Z72<>\"\",'S100'!Z72,\"X\")","v":"X"},{"$f":"IF('Mod05'!G33<>\"\",'Mod05'!G33,\"X\")","v":"X"},null,{"$f":"SUM(D16:D215)","v":0},"(1)","(2)","(3)","(4)","(5)      Niveles educativos que usan el ambiente",null,null,null,null,null,null,null,null,null,null,null,null,null,null,null,null,null,null,null,null,null,null,null,null,null,null,"(6)","(7)","(8)","(9)","(10)",null,"(11)",null,"(12)",null,"(13)","Tenencia y estado de conservación del mobiliario en uso en las aulas o ambientes acondicionados como aulas de clase"]
["Turno noche",null,null,null,null,null,null,null,null,null,{"$f":"IF('S100'!Z73<>\"\",'S100'!Z73,\"X\")","v":"X"},{"$f":"IF('Mod05'!G34<>\"\",'Mod05'!G34,\"X\")","v":"X"},null,null,null,null,null,"¿Este ambiente de Aula de Clase es:?\n\n01-Regular\n02-Funcional","Cantidad de estudiantes por aula y turno",null,null,null,null,null,null,null,null,null,null,null,null,null,null,null,null,null,null,null,null,null,null,null,null,null,null,null,"Puertas","Cerraduras","Ventanas","Paredes",null,"Techo",null,"Piso",null,"Instalaciones eléctricas","(14)\nMesas unipersonales","(15)\nMesas multiples","(16)\nCarpetas Unipersonales","(17)\nCarpetas Bipersonales","(18)","(19)\nPizarras"]
[null,null,null,null,null,null,null,null,null,null,null,{"$f":"IF('Mod05'!G35<>\"\",'Mod05'!G35,\"X\")","v":"X"},null,"Nº","Nº de edifica-\nción","Nº de piso","El ambiente ¿Se encuentra en uso?",null,"(1)\nTurno mañana",null,null,null,null,null,null,null,null,"(2)\nTurno tarde",null,null,null,null,null,null,null,null,"(3)\nTurno noche",null,null,null,null,null,null,null,null,"¿Cuenta con señaliza- ción de seguridad?","\n\nCantidad","\n\nCantidad","\n\nCantidad","(1)\n\nMaterial\npredominante","(2)\n\nEstado de conservación","(1)\n\nMaterial\npredominante","(2)\n\nEstado de conservación","(1)\n\nMaterial\npredominante","(2)\n\nEstado de conservación","¿Tiene?",null,null,null,null,"Sillas","(1)\n\nCantidad total \n\n(2)+(3)+(4)","Cantidad por estado de conservación",null,null,"(5)\n\nCantidad de pizarras de tiza (verdes/negras)"]
[null,null,"Corr","Uso","NivM","NivT","NivN","NM","TT","TN","SNU",{"$f":"IF('Mod05'!G36<>\"\",'Mod05'!G36,\"X\")","v":"X"},null,null,null,null,null,"01-Regular\n02-Funcional","(1)\nNivel","(2)\nEdad, Grado, Ciclo",null,null,null,null,null,"(3)\nSección","(4)\nNº de estudi- antes","(1)\nNivel","(2)\nEdad, Grado, Ciclo",null,null,null,null,null,"(3)\nSección","(4)\nNº de estudi- antes","(1)\nNivel","(2)\nEdad, Grado, Ciclo",null,null,null,null,null,"(3)\nSección","(4)\nNº de estudi- antes",null,null,null,null,null,null,null,null,null,null,null,"Cantidad\ntotal","Cantidad total","Cantidad\ntotal","Cantidad\ntotal","Cantidad total",null,"(2)\nEn buen estado","(3)\nRequieren mantenimiento","(4)\nrequieren sustituirse"]
["TABLA 01 NIVEL Y MODALIDAD",null,1,{"$f":"IF(AND($N16<>\"\",$Q16<>\"\"),1,0)","v":0},{"$f":"IF(ISERROR(VLOOKUP($S16,$A$17:$B$33,2,FALSE)),\"\",VLOOKUP($S16,$A$17:$B$33,2,FALSE))","v":""},{"$f":"IF(ISERROR(VLOOKUP($AB16,$A$17:$B$33,2,FALSE)),\"\",VLOOKUP($AB16,$A$17:$B$33,2,FALSE))","v":""},{"$f":"IF(ISERROR(VLOOKUP($AK16,$A$17:$B$33,2,FALSE)),\"\",VLOOKUP($AK16,$A$17:$B$33,2,FALSE))","v":""},{"$f":"IF(OR(LEFT(S16,2)=\"K0\",LEFT(S16,2)=\"T0\",LEFT(S16,2)=\"M0\",LEFT(S16,2)=\"P0\",LEFT(S16,2)=\"S0\"),1,0)","v":0},{"$f":"IF(OR(LEFT(AB16,2)=\"K0\",LEFT(AB16,2)=\"T0\",LEFT(AB16,2)=\"M0\",LEFT(AB16,2)=\"P0\",LEFT(AB16,2)=\"S0\"),1,0)","v":0},{"$f":"IF(OR(LEFT(AK16,2)=\"K0\",LEFT(AK16,2)=\"T0\",LEFT(AK16,2)=\"M0\",LEFT(AK16,2)=\"P0\",LEFT(AK16,2)=\"S0\"),1,0)","v":0},{"$f":"IF(SUM(H16:J16)>0,\"X\",\"\")","v":""},{"$f":"IF('Mod05'!G37<>\"\",'Mod05'!G37,\"X\")","v":"X"},null,{"$f":"IF(C16<=$Z$9,C16,\"\")","v":""},"","","","","","","","","","","","","","","","","","","","","","","","","","","","","","","","","","","","","","","","","","","","","","","","","","","","","","","","","","","","","",""]
["A1: INICIAL - Cuna ","AE_ines",2,0,"","","",{"$f":"IF(OR(LEFT(S17,2)=\"K0\",LEFT(S17,2)=\"T0\",LEFT(S17,2)=\"M0\",LEFT(S17,2)=\"P0\",LEFT(S17,2)=\"S0\"),1,0)","v":0},{"$f":"IF(OR(LEFT(AB17,2)=\"K0\",LEFT(AB17,2)=\"T0\",LEFT(AB17,2)=\"M0\",LEFT(AB17,2)=\"P0\",LEFT(AB17,2)=\"S0\"),1,0)","v":0},{"$f":"IF(OR(LEFT(AK17,2)=\"K0\",LEFT(AK17,2)=\"T0\",LEFT(AK17,2)=\"M0\",LEFT(AK17,2)=\"P0\",LEFT(AK17,2)=\"S0\"),1,0)","v":0},{"$f":"IF(SUM(H17:J17)>0,\"X\",\"\")","v":""},{"$f":"IF('Mod05'!G38<>\"\",'Mod05'!G38,\"X\")","v":"X"},null,"","","","","","","","","","","","","","","","","","","","","","","","","","","","","","","","","","","","","","","","","","","","","","","","","","","","","","","","","","","","","","",""]
["A2: INICIAL - Jardín","A2_ini",3,0,"","","",{"$f":"IF(OR(LEFT(S18,2)=\"K0\",LEFT(S18,2)=\"T0\",LEFT(S18,2)=\"M0\",LEFT(S18,2)=\"P0\",LEFT(S18,2)=\"S0\"),1,0)","v":0},{"$f":"IF(OR(LEFT(AB18,2)=\"K0\",LEFT(AB18,2)=\"T0\",LEFT(AB18,2)=\"M0\",LEFT(AB18,2)=\"P0\",LEFT(AB18,2)=\"S0\"),1,0)","v":0},{"$f":"IF(OR(LEFT(AK18,2)=\"K0\",LEFT(AK18,2)=\"T0\",LEFT(AK18,2)=\"M0\",LEFT(AK18,2)=\"P0\",LEFT(AK18,2)=\"S0\"),1,0)","v":0},{"$f":"IF(SUM(H18:J18)>0,\"X\",\"\")","v":""},{"$f":"IF('Mod05'!G39<>\"\",'Mod05'!G39,\"X\")","v":"X"},null,"","","","","","","","","","","","","","","","","","","","","","","","","","","","","","","","","","","","","","","","","","","","","","","","","","","","","","","","","","","","","","",""]
["A3: INICIAL - Cuna Jardín","AE_inoees",4,{"$f":"IF(AND($N19<>\"\",$Q19<>\"\"),1,0)","v":0},{"$f":"IF(ISERROR(VLOOKUP($S21,$A$17:$B$33,2,FALSE)),\"\",VLOOKUP($S21,$A$17:$B$33,2,FALSE))","v":""},"","",0,0,0,"",{"$f":"IF('Mod05'!G40<>\"\",'Mod05'!G40,\"X\")","v":"X"},null,"","","","","","","","","","","","","","","","","","","","","","","","","","","","","","","","","","","","","","","","","","","","","","","","","","","","","","","","","","","","","","",""]
["A5: INICIAL No Escolarizado","AE_inoees",5,0,{"$f":"IF(ISERROR(VLOOKUP($S22,$A$17:$B$33,2,FALSE)),\"\",VLOOKUP($S22,$A$17:$B$33,2,FALSE))","v":""},"","",0,0,0,"",{"$f":"IF('Mod05'!G41<>\"\",'Mod05'!G41,\"X\")","v":"X"},null,"","","","","","","","","","","","","","","","","","","","","","","","","","","","","","","","","","","","","","","","","","","","","","","","","","","","","","","","","","","","","","",""]
["B0: EBR-Primaria","BE_pres",6,0,{"$f":"IF(ISERROR(VLOOKUP(#REF!,$A$17:$B$33,2,FALSE)),\"\",VLOOKUP(#REF!,$A$17:$B$33,2,FALSE))","v":""},"","",0,0,0,"",{"$f":"IF('Mod05'!G42<>\"\",'Mod05'!G42,\"X\")","v":"X"},null,"","","","","","","","","","","","","","","","","","","","","","","","","","","","","","","","","","","","","","","","","","","","","","","","","","","","","","","","","","","","","","",""]
["F0: EBR-Secundaria","F0_sec",7,0,{"$f":"IF(ISERROR(VLOOKUP(#REF!,$A$17:$B$33,2,FALSE)),\"\",VLOOKUP(#REF!,$A$17:$B$33,2,FALSE))","v":""},"","",0,0,0,"",{"$f":"IF('Mod05'!G43<>\"\",'Mod05'!G43,\"X\")","v":"X"},null,"","","","","","","","","","","","","","","","","","","","","","","","","","","","","","","","","","","","","","","","","","","","","","","","","","","","","","","","","","","","","","",""]
["D1: EBA-Ini e Int","D1_eba",8,0,"","","",0,0,0,"",{"$f":"IF('Mod05'!G44<>\"\",'Mod05'!G44,\"X\")","v":"X"},null,"","","","","","","","","","","","","","","","","","","","","","","","","","","","","","","","","","","","","","","","","","","","","","","","","","","","","","","","","","","","","","",""]
["D2: EBA-Avanzado","D2_eba",9,0,"","","",0,0,0,"",{"$f":"IF('Mod05'!G45<>\"\",'Mod05'!G45,\"X\")","v":"X"},null,"","","","","","","","","","","","","","","","","","","","","","","","","","","","","","","","","","","","","","","","","","","","","","","","","","","","","","","","","","","","","","",""]
["E0: EBE-PRITE","AE_ines",10,0,"","","",0,0,0,"",{"$f":"IF('Mod05'!G46<>\"\",'Mod05'!G46,\"X\")","v":"X"},null,"","","","","","","","","","","","","","","","","","","","","","","","","","","","","","","","","","","","","","","","","","","","","","","","","","","","","","","","","","","","","","",""]
["E1: EBE-Inicial","AE_inoees",11,0,"","","",0,0,0,"",{"$f":"IF('Mod05'!G47<>\"\",'Mod05'!G47,\"X\")","v":"X"},null,"","","","","","","","","","","","","","","","","","","","","","","","","","","","","","","","","","","","","","","","","","","","","","","","","","","","","","","","","","","","","","",""]
["E2: EBE-Primaria","BE_pres",12,0,"","","",0,0,0,"",{"$f":"IF('Mod05'!G48<>\"\",'Mod05'!G48,\"X\")","v":"X"},null,"","","","","","","","","","","","","","","","","","","","","","","","","","","","","","","","","","","","","","","","","","","","","","","","","","","","","","","","","","","","","","",""]
["L0: ETP-CETPRO","L0_etp",13,0,"","","",0,0,0,"",{"$f":"IF('Mod05'!G49<>\"\",'Mod05'!G49,\"X\")","v":"X"},null,"","","","","","","","","","","","","","","","","","","","","","","","","","","","","","","","","","","","","","","","","","","","","","","","","","","","","","","","","","","","","","",""]
["K0: IESP","KPM_sup",14,0,"","","",0,0,0,"",{"$f":"IF('Mod05'!G50<>\"\",'Mod05'!G50,\"X\")","v":"X"},null,"","","","","","","","","","","","","","","","","","","","","","","","","","","","","","","","","","","","","","","","","","","","","","","","","","","","","","","","","","","","","","",""]
["T0: IEST","TS_sup",15,0,"","","",0,0,0,"",{"$f":"IF('Mod05'!G51<>\"\",'Mod05'!G51,\"X\")","v":"X"},null,"","","","","","","","","","","","","","","","","","","","","","","","","","","","","","","","","","","","","","","","","","","","","","","","","","","","","","","","","","","","","","",""]
["M0: ESFA","KPM_sup",16,0,"","","",0,0,0,"",{"$f":"IF('Mod05'!G52<>\"\",'Mod05'!G52,\"X\")","v":"X"},null,"","","","","","","","","","","","","","","","","","","","","","","","","","","","","","","","","","","","","","","","","","","","","","","","","","","","","","","","","","","","","","",""]
["P0: EESP","KPM_sup",17,0,"","","",0,0,0,"",{"$f":"IF('Mod05'!G53<>\"\",'Mod05'!G53,\"X\")","v":"X"},null,"","","","","","","","","","","","","","","","","","","","","","","","","","","","","","","","","","","","","","","","","","","","","","","","","","","","","","","","","","","","","","",""]
["S0: EEST","TS_sup",18,0,"","","",0,0,0,"",{"$f":"IF('Mod05'!G54<>\"\",'Mod05'!G54,\"X\")","v":"X"},null,"","","","","","","","","","","","","","","","","","","","","","","","","","","","","","","","","","","","","","","","","","","","","","","","","","","","","","","","","","","","","","",""]
[null,null,19,0,"","","",0,0,0,"",{"$f":"IF('Mod05'!G55<>\"\",'Mod05'!G55,\"X\")","v":"X"},null,"","","","","","","","","","","","","","","","","","","","","","","","","","","","","","","","","","","","","","","","","","","","","","","","","","","","","","","","","","","","","","",""]
["TABLA 02 - Puertas",null,20,0,"","","",0,0,0,"",{"$f":"IF('Mod05'!G56<>\"\",'Mod05'!G56,\"X\")","v":"X"},null,"","","","","","","","","","","","","","","","","","","","","","","","","","","","","","","","","","","","","","","","","","","","","","","","","","","","","","","","","","","","","","",""]
["01: Madera",null,21,0,"","","",0,0,0,"",{"$f":"IF('Mod05'!G57<>\"\",'Mod05'!G57,\"X\")","v":"X"},null,"","","","","","","","","","","","","","","","","","","","","","","","","","","","","","","","","","","","","","","","","","","","","","","","","","","","","","","","","","","","","","",""]
["02: Mallas metálicas",null,22,0,"","","",0,0,0,"",{"$f":"IF('Mod05'!G58<>\"\",'Mod05'!G58,\"X\")","v":"X"},null,"","","","","","","","","","","","","","","","","","","","","","","","","","","","","","","","","","","","","","","","","","","","","","","","","","","","","","","","","","","","","","",""]
["03: Rejas metálicas",null,23,0,"","","",0,0,0,"",{"$f":"IF('Mod05'!G59<>\"\",'Mod05'!G59,\"X\")","v":"X"},null,"","","","","","","","","","","","","","","","","","","","","","","","","","","","","","","","","","","","","","","","","","","","","","","","","","","","","","","","","","","","","","",""]
["04: Planchas metálicas",null,24,0,"","","",0,0,0,"",{"$f":"IF('Mod05'!G60<>\"\",'Mod05'!G60,\"X\")","v":"X"},null,"","","","","","","","","","","","","","","","","","","","","","","","","","","","","","","","","","","","","","","","","","","","","","","","","","","","","","","","","","","","","","",""]
["05: Drywall",null,25,0,"","","",0,0,0,"",{"$f":"IF('Mod05'!G61<>\"\",'Mod05'!G61,\"X\")","v":"X"},null,"","","","","","","","","","","","","","","","","","","","","","","","","","","","","","","","","","","","","","","","","","","","","","","","","","","","","","","","","","","","","","",""]
["06: Vidrio",null,26,0,"","","",0,0,0,"",{"$f":"IF('Mod05'!G62<>\"\",'Mod05'!G62,\"X\")","v":"X"},null,"","","","","","","","","","","","","","","","","","","","","","","","","","","","","","","","","","","","","","","","","","","","","","","","","","","","","","","","","","","","","","",""]
["07: Otro",null,27,0,"","","",0,0,0,"",{"$f":"IF('Mod05'!G63<>\"\",'Mod05'!G63,\"X\")","v":"X"},null,"","","","","","","","","","","","","","","","","","","","","","","","","","","","","","","","","","","","","","","","","","","","","","","","","","","","","","","","","","","","","","",""]
["08: NT pero lo requiere",null,28,0,"","","",0,0,0,"",{"$f":"IF('Mod05'!G64<>\"\",'Mod05'!G64,\"X\")","v":"X"},null,"","","","","","","","","","","","","","","","","","","","","","","","","","","","","","","","","","","","","","","","","","","","","","","","","","","","","","","","","","","","","","",""]
["09: NT y no lo requiere",null,29,0,"","","",0,0,0,"",{"$f":"IF('Mod05'!G65<>\"\",'Mod05'!G65,\"X\")","v":"X"},null,"","","","","","","","","","","","","","","","","","","","","","","","","","","","","","","","","","","","","","","","","","","","","","","","","","","","","","","","","","","","","","",""]
[null,null,30,0,"","","",0,0,0,"",{"$f":"IF('Mod05'!G66<>\"\",'Mod05'!G66,\"X\")","v":"X"},null,"","","","","","","","","","","","","","","","","","","","","","","","","","","","","","","","","","","","","","","","","","","","","","","","","","","","","","","","","","","","","","",""]
["TABLA 03 - Ventanas",null,31,0,"","","",0,0,0,"",{"$f":"IF('Mod05'!G67<>\"\",'Mod05'!G67,\"X\")","v":"X"},null,"","","","","","","","","","","","","","","","","","","","","","","","","","","","","","","","","","","","","","","","","","","","","","","","","","","","","","","","","","","","","","",""]
["01: De metal",null,32,0,"","","",0,0,0,"",{"$f":"IF('Mod05'!G68<>\"\",'Mod05'!G68,\"X\")","v":"X"},null,"","","","","","","","","","","","","","","","","","","","","","","","","","","","","","","","","","","","","","","","","","","","","","","","","","","","","","","","","","","","","","",""]
["02: De madera",null,33,0,"","","",0,0,0,"",{"$f":"IF('Mod05'!G69<>\"\",'Mod05'!G69,\"X\")","v":"X"},null,{"$f":"IF(C48<=$Z$9,C48,\"\")","v":""},"","","","","","","","","","","","","","","","","","","","","","","","","","","","","","","","","","","","","","","","","","","","","","","","","","","","","","","","","","","","","",""]
["03: De PVC",null,34,0,"","","",0,0,0,"",{"$f":"IF('Mod05'!G70<>\"\",'Mod05'!G70,\"X\")","v":"X"},null,"","","","","","","","","","","","","","","","","","","","","","","","","","","","","","","","","","","","","","","","","","","","","","","","","","","","","","","","","","","","","","",""]
["04: Mixta",null,35,0,"","","",0,0,0,"",{"$f":"IF('Mod05'!G71<>\"\",'Mod05'!G71,\"X\")","v":"X"},null,"","","","","","","","","","","","","","","","","","","","","","","","","","","","","","","","","","","","","","","","","","","","","","","","","","","","","","","","","","","","","","",""]
["05: Otro",null,36,0,"","","",0,0,0,"",{"$f":"IF('Mod05'!G72<>\"\",'Mod05'!G72,\"X\")","v":"X"},null,"","","","","","","","","","","","","","","","","","","","","","","","","","","","","","","","","","","","","","","","","","","","","","","","","","","","","","","","","","","","","","",""]
["06: NT pero lo requiere",null,37,0,"","","",0,0,0,"",{"$f":"IF('Mod05'!G73<>\"\",'Mod05'!G73,\"X\")","v":"X"},null,"","","","","","","","","","","","","","","","","","","","","","","","","","","","","","","","","","","","","","","","","","","","","","","","","","","","","","","","","","","","","","",""]
["07: NT y no lo requiere",null,38,0,"","","",0,0,0,"",{"$f":"IF('Mod05'!G74<>\"\",'Mod05'!G74,\"X\")","v":"X"},null,"","","","","","","","","","","","","","","","","","","","","","","","","","","","","","","","","","","","","","","","","","","","","","","","","","","","","","","","","","","","","","",""]
[null,null,39,0,"","","",0,0,0,"",{"$f":"IF('Mod05'!G75<>\"\",'Mod05'!G75,\"X\")","v":"X"},null,"","","","","","","","","","","","","","","","","","","","","","","","","","","","","","","","","","","","","","","","","","","","","","","","","","","","","","","","","","","","","","",""]
["TABLA 04 - Paredes",null,40,0,"","","",0,0,0,"",{"$f":"IF('Mod05'!G76<>\"\",'Mod05'!G76,\"X\")","v":"X"},null,"","","","","","","","","","","","","","","","","","","","","","","","","","","","","","","","","","","","","","","","","","","","","","","","","","","","","","","","","","","","","","",""]
["01: Ladrillo o concreto",null,41,0,"","","",0,0,0,"",{"$f":"IF('Mod05'!G77<>\"\",'Mod05'!G77,\"X\")","v":"X"},null,"","","","","","","","","","","","","","","","","","","","","","","","","","","","","","","","","","","","","","","","","","","","","","","","","","","","","","","","","","","","","","",""]
["02: Adobe o tapial",null,42,0,"","","",0,0,0,"",{"$f":"IF('Mod05'!G78<>\"\",'Mod05'!G78,\"X\")","v":"X"},null,"","","","","","","","","","","","","","","","","","","","","","","","","","","","","","","","","","","","","","","","","","","","","","","","","","","","","","","","","","","","","","",""]
["03: Quincha",null,43,0,"","","",0,0,0,"",{"$f":"IF('Mod05'!G79<>\"\",'Mod05'!G79,\"X\")","v":"X"},null,"","","","","","","","","","","","","","","","","","","","","","","","","","","","","","","","","","","","","","","","","","","","","","","","","","","","","","","","","","","","","","",""]
["04: Piedra con barro cal o cemento",null,44,0,"","","",0,0,0,"",{"$f":"IF('Mod05'!G80<>\"\",'Mod05'!G80,\"X\")","v":"X"},null,"","","","","","","","","","","","","","","","","","","","","","","","","","","","","","","","","","","","","","","","","","","","","","","","","","","","","","","","","","","","","","",""]
["05: Madera",null,45,0,"","","",0,0,0,"",{"$f":"IF('Mod05'!G81<>\"\",'Mod05'!G81,\"X\")","v":"X"},null,"","","","","","","","","","","","","","","","","","","","","","","","","","","","","","","","","","","","","","","","","","","","","","","","","","","","","","","","","","","","","","",""]
["06: Triplay",null,46,0,"","","",0,0,0,"",{"$f":"IF('Mod05'!G82<>\"\",'Mod05'!G82,\"X\")","v":"X"},null,"","","","","","","","","","","","","","","","","","","","","","","","","","","","","","","","","","","","","","","","","","","","","","","","","","","","","","","","","","","","","","",""]
["07: Eternit o fibra de concreto",null,47,0,"","","",0,0,0,"",{"$f":"IF('Mod05'!G83<>\"\",'Mod05'!G83,\"X\")","v":"X"},null,"","","","","","","","","","","","","","","","","","","","","","","","","","","","","","","","","","","","","","","","","","","","","","","","","","","","","","","","","","","","","","",""]
["08: Estera, cartón o plástico",null,48,0,"","","",0,0,0,"",{"$f":"IF('Mod05'!G84<>\"\",'Mod05'!G84,\"X\")","v":"X"},null,"","","","","","","","","","","","","","","","","","","","","","","","","","","","","","","","","","","","","","","","","","","","","","","","","","","","","","","","","","","","","","",""]
["09: Otro",null,49,0,"","","",0,0,0,"",{"$f":"IF('Mod05'!G85<>\"\",'Mod05'!G85,\"X\")","v":"X"},null,"","","","","","","","","","","","","","","","","","","","","","","","","","","","","","","","","","","","","","","","","","","","","","","","","","","","","","","","","","","","","","",""]
[null,null,50,0,"","","",0,0,0,"",{"$f":"IF('Mod05'!G86<>\"\",'Mod05'!G86,\"X\")","v":"X"},null,"","","","","","","","","","","","","","","","","","","","","","","","","","","","","","","","","","","","","","","","","","","","","","","","","","","","","","","","","","","","","","",""]
["TABLA 05 - Techo",null,51,0,"","","",0,0,0,"",{"$f":"IF('Mod05'!G87<>\"\",'Mod05'!G87,\"X\")","v":"X"},null,"","","","","","","","","","","","","","","","","","","","","","","","","","","","","","","","","","","","","","","","","","","","","","","","","","","","","","","","","","","","","","",""]
["01: Concreto armado",null,52,0,"","","",0,0,0,"",{"$f":"IF('Mod05'!G88<>\"\",'Mod05'!G88,\"X\")","v":"X"},null,"","","","","","","","","","","","","","","","","","","","","","","","","","","","","","","","","","","","","","","","","","","","","","","","","","","","","","","","","","","","","","",""]
["02: Madera",null,53,0,"","","",0,0,0,"",{"$f":"IF('Mod05'!G89<>\"\",'Mod05'!G89,\"X\")","v":"X"},null,"","","","","","","","","","","","","","","","","","","","","","","","","","","","","","","","","","","","","","","","","","","","","","","","","","","","","","","","","","","","","","",""]
["03: Teja",null,54,0,"","","",0,0,0,"",{"$f":"IF('Mod05'!G90<>\"\",'Mod05'!G90,\"X\")","v":"X"},null,"","","","","","","","","","","","","","","","","","","","","","","","","","","","","","","","","","","","","","","","","","","","","","","","","","","","","","","","","","","","","","",""]
["04: Fibra de cemento",null,55,0,"","","",0,0,0,"",{"$f":"IF('Mod05'!G91<>\"\",'Mod05'!G91,\"X\")","v":"X"},null,"","","","","","","","","","","","","","","","","","","","","","","","","","","","","","","","","","","","","","","","","","","","","","","","","","","","","","","","","","","","","","",""]
["05: Calamina",null,56,0,"","","",0,0,0,"",{"$f":"IF('Mod05'!G92<>\"\",'Mod05'!G92,\"X\")","v":"X"},null,"","","","","","","","","","","","","","","","","","","","","","","","","","","","","","","","","","","","","","","","","","","","","","","","","","","","","","","","","","","","","","",""]
["06: Calaminon",null,57,0,"","","",0,0,0,"",{"$f":"IF('Mod05'!G93<>\"\",'Mod05'!G93,\"X\")","v":"X"},null,"","","","","","","","","","","","","","","","","","","","","","","","","","","","","","","","","","","","","","","","","","","","","","","","","","","","","","","","","","","","","","",""]
["07: Eternit",null,58,0,"","","",0,0,0,"",{"$f":"IF('Mod05'!G94<>\"\",'Mod05'!G94,\"X\")","v":"X"},null,"","","","","","","","","","","","","","","","","","","","","","","","","","","","","","","","","","","","","","","","","","","","","","","","","","","","","","","","","","","","","","",""]
["08: Caña con barro",null,59,0,"","","",0,0,0,"",{"$f":"IF('Mod05'!G95<>\"\",'Mod05'!G95,\"X\")","v":"X"},null,"","","","","","","","","","","","","","","","","","","","","","","","","","","","","","","","","","","","","","","","","","","","","","","","","","","","","","","","","","","","","","",""]
["09: Lata o latón",null,60,0,"","","",0,0,0,"",{"$f":"IF('Mod05'!G96<>\"\",'Mod05'!G96,\"X\")","v":"X"},null,"","","","","","","","","","","","","","","","","","","","","","","","","","","","","","","","","","","","","","","","","","","","","","","","","","","","","","","","","","","","","","",""]
["10: Otro",null,61,0,"","","",0,0,0,"",{"$f":"IF('Mod05'!G97<>\"\",'Mod05'!G97,\"X\")","v":"X"},null,"","","","","","","","","","","","","","","","","","","","","","","","","","","","","","","","","","","","","","","","","","","","","","","","","","","","","","","","","","","","","","",""]
[null,null,62,0,"","","",0,0,0,"",{"$f":"IF('Mod05'!G98<>\"\",'Mod05'!G98,\"X\")","v":"X"},null,"","","","","","","","","","","","","","","","","","","","","","","","","","","","","","","","","","","","","","","","","","","","","","","","","","","","","","","","","","","","","","",""]
["TABLA 06 - Piso",null,63,0,"","","",0,0,0,"",{"$f":"IF('Mod05'!G99<>\"\",'Mod05'!G99,\"X\")","v":"X"},null,"","","","","","","","","","","","","","","","","","","","","","","","","","","","","","","","","","","","","","","","","","","","","","","","","","","","","","","","","","","","","","",""]
["01: Parquet o madera pulida",null,64,0,"","","",0,0,0,"",{"$f":"IF('Mod05'!G100<>\"\",'Mod05'!G100,\"X\")","v":"X"},null,"","","","","","","","","","","","","","","","","","","","","","","","","","","","","","","","","","","","","","","","","","","","","","","","","","","","","","","","","","","","","","",""]
["02: Vinilico, pisopak o similar",null,65,{"$f":"IF(AND($N80<>\"\",$Q80<>\"\"),1,0)","v":0},{"$f":"IF(ISERROR(VLOOKUP($S80,$A$17:$B$33,2,FALSE)),\"\",VLOOKUP($S80,$A$17:$B$33,2,FALSE))","v":""},{"$f":"IF(ISERROR(VLOOKUP($AB80,$A$17:$B$33,2,FALSE)),\"\",VLOOKUP($AB80,$A$17:$B$33,2,FALSE))","v":""},{"$f":"IF(ISERROR(VLOOKUP($AK80,$A$17:$B$33,2,FALSE)),\"\",VLOOKUP($AK80,$A$17:$B$33,2,FALSE))","v":""},0,0,0,"",{"$f":"IF('Mod05'!G101<>\"\",'Mod05'!G101,\"X\")","v":"X"},null,{"$f":"IF(C80<=$Z$9,C80,\"\")","v":""},"","","","","","","","","","","","","","","","","","","","","","","","","","","","","","","","","","","","","","","","","","","","","","","","","","","","","","","","","","","","","",""]
["03: Loseta, cerámico o similar",null,66,0,"","","",0,0,0,"",{"$f":"IF('Mod05'!G102<>\"\",'Mod05'!G102,\"X\")","v":"X"},null,"","","","","","","","","","","","","","","","","","","","","","","","","","","","","","","","","","","","","","","","","","","","","","","","","","","","","","","","","","","","","","",""]
["04: Cemento",null,67,0,"","","",{"$f":"IF(OR(LEFT(S82,2)=\"K0\",LEFT(S82,2)=\"T0\",LEFT(S82,2)=\"M0\",LEFT(S82,2)=\"P0\",LEFT(S82,2)=\"S0\"),1,0)","v":0},{"$f":"IF(OR(LEFT(AB82,2)=\"K0\",LEFT(AB82,2)=\"T0\",LEFT(AB82,2)=\"M0\",LEFT(AB82,2)=\"P0\",LEFT(AB82,2)=\"S0\"),1,0)","v":0},{"$f":"IF(OR(LEFT(AK82,2)=\"K0\",LEFT(AK82,2)=\"T0\",LEFT(AK82,2)=\"M0\",LEFT(AK82,2)=\"P0\",LEFT(AK82,2)=\"S0\"),1,0)","v":0},{"$f":"IF(SUM(H82:J82)>0,\"X\",\"\")","v":""},{"$f":"IF('Mod05'!G103<>\"\",'Mod05'!G103,\"X\")","v":"X"},null,"","","","","","","","","","","","","","","","","","","","","","","","","","","","","","","","","","","","","","","","","","","","","","","","","","","","","","","","","","","","","","",""]
["05: Madera (entablado)",null,68,0,"","","",0,0,0,"",{"$f":"IF('Mod05'!G104<>\"\",'Mod05'!G104,\"X\")","v":"X"},null,"","","","","","","","","","","","","","","","","","","","","","","","","","","","","","","","","","","","","","","","","","","","","","","","","","","","","","","","","","","","","","",""]
["06: Tierra",null,69,0,"","","",0,0,0,"",{"$f":"IF('Mod05'!G105<>\"\",'Mod05'!G105,\"X\")","v":"X"},null,"","","","","","","","","","","","","","","","","","","","","","","","","","","","","","","","","","","","","","","","","","","","","","","","","","","","","","","","","","","","","","",""]
["07: Otro",null,70,0,"","","",0,0,0,"",{"$f":"IF('Mod05'!G106<>\"\",'Mod05'!G106,\"X\")","v":"X"},null,"","","","","","","","","","","","","","","","","","","","","","","","","","","","","","","","","","","","","","","","","","","","","","","","","","","","","","","","","","","","","","",""]
[null,null,71,0,"","","",0,0,0,"",{"$f":"IF('Mod05'!G107<>\"\",'Mod05'!G107,\"X\")","v":"X"},null,"","","","","","","","","","","","","","","","","","","","","","","","","","","","","","","","","","","","","","","","","","","","","","","","","","","","","","","","","","","","","","",""]
["TABLA 07 - Estado",null,72,0,"","","",0,0,0,"",{"$f":"IF('Mod05'!G108<>\"\",'Mod05'!G108,\"X\")","v":"X"},null,"","","","","","","","","","","","","","","","","","","","","","","","","","","","","","","","","","","","","","","","","","","","","","","","","","","","","","","","","","","","","","",""]
["01: Bueno",null,73,0,"","","",0,0,0,"",{"$f":"IF('Mod05'!G109<>\"\",'Mod05'!G109,\"X\")","v":"X"},null,"","","","","","","","","","","","","","","","","","","","","","","","","","","","","","","","","","","","","","","","","","","","","","","","","","","","","","","","","","","","","","",""]
["02: Regular",null,74,0,"","","",0,0,0,"",{"$f":"IF('Mod05'!G110<>\"\",'Mod05'!G110,\"X\")","v":"X"},null,"","","","","","","","","","","","","","","","","","","","","","","","","","","","","","","","","","","","","","","","","","","","","","","","","","","","","","","","","","","","","","",""]
["03: Mal estado",null,75,0,"","","",0,0,0,"",{"$f":"IF('Mod05'!G111<>\"\",'Mod05'!G111,\"X\")","v":"X"},null,"","","","","","","","","","","","","","","","","","","","","","","","","","","","","","","","","","","","","","","","","","","","","","","","","","","","","","","","","","","","","","",""]
["04: No aplica",null,76,0,"","","",0,0,0,"",{"$f":"IF('Mod05'!G112<>\"\",'Mod05'!G112,\"X\")","v":"X"},null,"","","","","","","","","","","","","","","","","","","","","","","","","","","","","","","","","","","","","","","","","","","","","","","","","","","","","","","","","","","","","","",""]
[null,null,77,0,"","","",0,0,0,"",{"$f":"IF('Mod05'!G113<>\"\",'Mod05'!G113,\"X\")","v":"X"},null,"","","","","","","","","","","","","","","","","","","","","","","","","","","","","","","","","","","","","","","","","","","","","","","","","","","","","","","","","","","","","","",""]
["Tabla : Si, No",null,78,0,"","","",0,0,0,"",{"$f":"IF('Mod05'!G114<>\"\",'Mod05'!G114,\"X\")","v":"X"},null,"","","","","","","","","","","","","","","","","","","","","","","","","","","","","","","","","","","","","","","","","","","","","","","","","","","","","","","","","","","","","","",""]
["SI",null,79,0,"","","",0,0,0,"",{"$f":"IF('Mod05'!G115<>\"\",'Mod05'!G115,\"X\")","v":"X"},null,"","","","","","","","","","","","","","","","","","","","","","","","","","","","","","","","","","","","","","","","","","","","","","","","","","","","","","","","","","","","","","",""]
["NO",null,80,0,"","","",0,0,0,"",{"$f":"IF('Mod05'!G116<>\"\",'Mod05'!G116,\"X\")","v":"X"},null,"","","","","","","","","","","","","","","","","","","","","","","","","","","","","","","","","","","","","","","","","","","","","","","","","","","","","","","","","","","","","","",""]
["NA",null,81,0,"","","",0,0,0,"",{"$f":"IF('Mod05'!G117<>\"\",'Mod05'!G117,\"X\")","v":"X"},null,"","","","","","","","","","","","","","","","","","","","","","","","","","","","","","","","","","","","","","","","","","","","","","","","","","","","","","","","","","","","","","",""]
["Tabla : ",null,82,0,"","","",0,0,0,"",{"$f":"IF('Mod05'!G118<>\"\",'Mod05'!G118,\"X\")","v":"X"},null,"","","","","","","","","","","","","","","","","","","","","","","","","","","","","","","","","","","","","","","","","","","","","","","","","","","","","","","","","","","","","","",""]
["01: Regular",null,83,0,"","","",0,0,0,"",{"$f":"IF('Mod05'!G119<>\"\",'Mod05'!G119,\"X\")","v":"X"},null,"","","","","","","","","","","","","","","","","","","","","","","","","","","","","","","","","","","","","","","","","","","","","","","","","","","","","","","","","","","","","","",""]
["02: Funcional",null,84,0,"","","",0,0,0,"",{"$f":"IF('Mod05'!G120<>\"\",'Mod05'!G120,\"X\")","v":"X"},null,"","","","","","","","","","","","","","","","","","","","","","","","","","","","","","","","","","","","","","","","","","","","","","","","","","","","","","","","","","","","","","",""]
[null,null,85,0,"","","",0,0,0,"",{"$f":"IF('Mod05'!G121<>\"\",'Mod05'!G121,\"X\")","v":"X"},null,"","","","","","","","","","","","","","","","","","","","","","","","","","","","","","","","","","","","","","","","","","","","","","","","","","","","","","","","","","","","","","",""]
["Tabla : Secciones",null,86,0,"","","",0,0,0,"",null,null,"","","","","","","","","","","","","","","","","","","","","","","","","","","","","","","","","","","","","","","","","","","","","","","","","","","","","","","","","","","","","","",""]
["A",null,87,0,"","","",0,0,0,"",null,null,"","","","","","","","","","","","","","","","","","","","","","","","","","","","","","","","","","","","","","","","","","","","","","","","","","","","","","","","","","","","","","",""]
["B",null,88,0,"","","",0,0,0,"",null,null,"","","","","","","","","","","","","","","","","","","","","","","","","","","","","","","","","","","","","","","","","","","","","","","","","","","","","","","","","","","","","","",""]
["C",null,89,0,"","","",0,0,0,"",null,null,"","","","","","","","","","","","","","","","","","","","","","","","","","","","","","","","","","","","","","","","","","","","","","","","","","","","","","","","","","","","","","",""]
["D",null,90,0,"","","",0,0,0,"",null,null,"","","","","","","","","","","","","","","","","","","","","","","","","","","","","","","","","","","","","","","","","","","","","","","","","","","","","","","","","","","","","","",""]
["E",null,91,0,"","","",0,0,0,"",null,null,"","","","","","","","","","","","","","","","","","","","","","","","","","","","","","","","","","","","","","","","","","","","","","","","","","","","","","","","","","","","","","",""]
["F",null,92,0,"","","",0,0,0,"",null,null,"","","","","","","","","","","","","","","","","","","","","","","","","","","","","","","","","","","","","","","","","","","","","","","","","","","","","","","","","","","","","","",""]
["G",null,93,0,"","","",0,0,0,"",null,null,"","","","","","","","","","","","","","","","","","","","","","","","","","","","","","","","","","","","","","","","","","","","","","","","","","","","","","","","","","","","","","",""]
["H",null,94,0,"","","",0,0,0,"",null,null,"","","","","","","","","","","","","","","","","","","","","","","","","","","","","","","","","","","","","","","","","","","","","","","","","","","","","","","","","","","","","","",""]
["I",null,95,0,"","","",0,0,0,"",null,null,"","","","","","","","","","","","","","","","","","","","","","","","","","","","","","","","","","","","","","","","","","","","","","","","","","","","","","","","","","","","","","",""]
["J",null,96,0,"","","",0,0,0,"",null,null,"","","","","","","","","","","","","","","","","","","","","","","","","","","","","","","","","","","","","","","","","","","","","","","","","","","","","","","","","","","","","","",""]
["K",null,97,0,"","","",0,0,0,"",null,null,{"$f":"IF(C112<=$Z$9,C112,\"\")","v":""},"","","","","","","","","","","","","","","","","","","","","","","","","","","","","","","","","","","","","","","","","","","","","","","","","","","","","","","","","","","","","",""]
["L",null,98,0,"","","",0,0,0,"",null,null,"","","","","","","","","","","","","","","","","","","","","","","","","","","","","","","","","","","","","","","","","","","","","","","","","","","","","","","","","","","","","","",""]
["M",null,99,0,"","","",0,0,0,"",null,null,"","","","","","","","","","","","","","","","","","","","","","","","","","","","","","","","","","","","","","","","","","","","","","","","","","","","","","","","","","","","","","",""]
["N",null,100,0,"","","",0,0,0,"",null,null,"","","","","","","","","","","","","","","","","","","","","","","","","","","","","","","","","","","","","","","","","","","","","","","","","","","","","","","","","","","","","","",""]
["O",null,101,0,"","","",0,0,0,"",null,null,"","","","","","","","","","","","","","","","","","","","","","","","","","","","","","","","","","","","","","","","","","","","","","","","","","","","","","","","","","","","","","",""]
["P",null,102,0,"","","",0,0,0,"",null,null,"","","","","","","","","","","","","","","","","","","","","","","","","","","","","","","","","","","","","","","","","","","","","","","","","","","","","","","","","","","","","","",""]
["Q",null,103,0,"","","",0,0,0,"",null,null,"","","","","","","","","","","","","","","","","","","","","","","","","","","","","","","","","","","","","","","","","","","","","","","","","","","","","","","","","","","","","","",""]
["R",null,104,0,"","","",0,0,0,"",null,null,"","","","","","","","","","","","","","","","","","","","","","","","","","","","","","","","","","","","","","","","","","","","","","","","","","","","","","","","","","","","","","",""]
["S",null,105,0,"","","",0,0,0,"",null,null,"","","","","","","","","","","","","","","","","","","","","","","","","","","","","","","","","","","","","","","","","","","","","","","","","","","","","","","","","","","","","","",""]
["T",null,106,0,"","","",0,0,0,"",null,null,"","","","","","","","","","","","","","","","","","","","","","","","","","","","","","","","","","","","","","","","","","","","","","","","","","","","","","","","","","","","","","",""]
["U",null,107,0,"","","",0,0,0,"",null,null,"","","","","","","","","","","","","","","","","","","","","","","","","","","","","","","","","","","","","","","","","","","","","","","","","","","","","","","","","","","","","","",""]
["V",null,108,0,"","","",0,0,0,"",null,null,"","","","","","","","","","","","","","","","","","","","","","","","","","","","","","","","","","","","","","","","","","","","","","","","","","","","","","","","","","","","","","",""]
["W",null,109,0,"","","",0,0,0,"",null,null,"","","","","","","","","","","","","","","","","","","","","","","","","","","","","","","","","","","","","","","","","","","","","","","","","","","","","","","","","","","","","","",""]
["X",null,110,0,"","","",0,0,0,"",null,null,"","","","","","","","","","","","","","","","","","","","","","","","","","","","","","","","","","","","","","","","","","","","","","","","","","","","","","","","","","","","","","",""]
["Y",null,111,0,"","","",0,0,0,"",null,null,"","","","","","","","","","","","","","","","","","","","","","","","","","","","","","","","","","","","","","","","","","","","","","","","","","","","","","","","","","","","","","",""]
["Z",null,112,0,"","","",0,0,0,"",null,null,"","","","","","","","","","","","","","","","","","","","","","","","","","","","","","","","","","","","","","","","","","","","","","","","","","","","","","","","","","","","","","",""]
["No-aplica",null,113,0,"","","",0,0,0,"",null,null,"","","","","","","","","","","","","","","","","","","","","","","","","","","","","","","","","","","","","","","","","","","","","","","","","","","","","","","","","","","","","","",""]
[null,null,114,0,"","","",0,0,0,"",null,null,"","","","","","","","","","","","","","","","","","","","","","","","","","","","","","","","","","","","","","","","","","","","","","","","","","","","","","","","","","","","","","",""]
[null,null,115,0,"","","",0,0,0,"",null,null,"","","","","","","","","","","","","","","","","","","","","","","","","","","","","","","","","","","","","","","","","","","","","","","","","","","","","","","","","","","","","","",""]
[null,null,116,0,"","","",0,0,0,"",null,null,"","","","","","","","","","","","","","","","","","","","","","","","","","","","","","","","","","","","","","","","","","","","","","","","","","","","","","","","","","","","","","",""]
[null,null,117,0,"","","",0,0,0,"",null,null,"","","","","","","","","","","","","","","","","","","","","","","","","","","","","","","","","","","","","","","","","","","","","","","","","","","","","","","","","","","","","","",""]
[null,null,118,0,"","","",0,0,0,"",null,null,"","","","","","","","","","","","","","","","","","","","","","","","","","","","","","","","","","","","","","","","","","","","","","","","","","","","","","","","","","","","","","",""]
[null,null,119,0,"","","",0,0,0,"",null,null,"","","","","","","","","","","","","","","","","","","","","","","","","","","","","","","","","","","","","","","","","","","","","","","","","","","","","","","","","","","","","","",""]
[null,null,120,0,"","","",0,0,0,"",null,null,"","","","","","","","","","","","","","","","","","","","","","","","","","","","","","","","","","","","","","","","","","","","","","","","","","","","","","","","","","","","","","",""]
[null,null,121,0,"","","",0,0,0,"",null,null,"","","","","","","","","","","","","","","","","","","","","","","","","","","","","","","","","","","","","","","","","","","","","","","","","","","","","","","","","","","","","","",""]
[null,null,122,0,"","","",0,0,0,"",null,null,"","","","","","","","","","","","","","","","","","","","","","","","","","","","","","","","","","","","","","","","","","","","","","","","","","","","","","","","","","","","","","",""]
[null,null,123,0,"","","",0,0,0,"",null,null,"","","","","","","","","","","","","","","","","","","","","","","","","","","","","","","","","","","","","","","","","","","","","","","","","","","","","","","","","","","","","","",""]
[null,null,124,0,"","","",0,0,0,"",null,null,"","","","","","","","","","","","","","","","","","","","","","","","","","","","","","","","","","","","","","","","","","","","","","","","","","","","","","","","","","","","","","",""]
[null,null,125,0,"","","",0,0,0,"",null,null,"","","","","","","","","","","","","","","","","","","","","","","","","","","","","","","","","","","","","","","","","","","","","","","","","","","","","","","","","","","","","","",""]
[null,null,126,0,"","","",0,0,0,"",null,null,"","","","","","","","","","","","","","","","","","","","","","","","","","","","","","","","","","","","","","","","","","","","","","","","","","","","","","","","","","","","","","",""]
[null,null,127,0,"","","",0,0,0,"",null,null,"","","","","","","","","","","","","","","","","","","","","","","","","","","","","","","","","","","","","","","","","","","","","","","","","","","","","","","","","","","","","","",""]
[null,null,128,0,"","","",0,0,0,"",null,null,"","","","","","","","","","","","","","","","","","","","","","","","","","","","","","","","","","","","","","","","","","","","","","","","","","","","","","","","","","","","","","",""]
[null,null,129,{"$f":"IF(AND($N144<>\"\",$Q144<>\"\"),1,0)","v":0},{"$f":"IF(ISERROR(VLOOKUP($S144,$A$17:$B$33,2,FALSE)),\"\",VLOOKUP($S144,$A$17:$B$33,2,FALSE))","v":""},{"$f":"IF(ISERROR(VLOOKUP($AB144,$A$17:$B$33,2,FALSE)),\"\",VLOOKUP($AB144,$A$17:$B$33,2,FALSE))","v":""},{"$f":"IF(ISERROR(VLOOKUP($AK144,$A$17:$B$33,2,FALSE)),\"\",VLOOKUP($AK144,$A$17:$B$33,2,FALSE))","v":""},0,0,0,"",null,null,{"$f":"IF(C144<=$Z$9,C144,\"\")","v":""},"","","","","","","","","","","","","","","","","","","","","","","","","","","","","","","","","","","","","","","","","","","","","","","","","","","","","","","","","","","","","",""]
[null,null,130,0,"","","",0,0,0,"",null,null,"","","","","","","","","","","","","","","","","","","","","","","","","","","","","","","","","","","","","","","","","","","","","","","","","","","","","","","","","","","","","","",""]
[null,null,131,0,"","","",{"$f":"IF(OR(LEFT(S146,2)=\"K0\",LEFT(S146,2)=\"T0\",LEFT(S146,2)=\"M0\",LEFT(S146,2)=\"P0\",LEFT(S146,2)=\"S0\"),1,0)","v":0},{"$f":"IF(OR(LEFT(AB146,2)=\"K0\",LEFT(AB146,2)=\"T0\",LEFT(AB146,2)=\"M0\",LEFT(AB146,2)=\"P0\",LEFT(AB146,2)=\"S0\"),1,0)","v":0},{"$f":"IF(OR(LEFT(AK146,2)=\"K0\",LEFT(AK146,2)=\"T0\",LEFT(AK146,2)=\"M0\",LEFT(AK146,2)=\"P0\",LEFT(AK146,2)=\"S0\"),1,0)","v":0},{"$f":"IF(SUM(H146:J146)>0,\"X\",\"\")","v":""},null,null,"","","","","","","","","","","","","","","","","","","","","","","","","","","","","","","","","","","","","","","","","","","","","","","","","","","","","","","","","","","","","","",""]
[null,null,132,0,"","","",0,0,0,"",null,null,"","","","","","","","","","","","","","","","","","","","","","","","","","","","","","","","","","","","","","","","","","","","","","","","","","","","","","","","","","","","","","",""]
[null,null,133,0,"","","",0,0,0,"",null,null,"","","","","","","","","","","","","","","","","","","","","","","","","","","","","","","","","","","","","","","","","","","","","","","","","","","","","","","","","","","","","","",""]
[null,null,134,0,"","","",0,0,0,"",null,null,"","","","","","","","","","","","","","","","","","","","","","","","","","","","","","","","","","","","","","","","","","","","","","","","","","","","","","","","","","","","","","",""]
[null,null,135,0,"","","",0,0,0,"",null,null,"","","","","","","","","","","","","","","","","","","","","","","","","","","","","","","","","","","","","","","","","","","","","","","","","","","","","","","","","","","","","","",""]
[null,null,136,0,"","","",0,0,0,"",null,null,"","","","","","","","","","","","","","","","","","","","","","","","","","","","","","","","","","","","","","","","","","","","","","","","","","","","","","","","","","","","","","",""]
[null,null,137,0,"","","",0,0,0,"",null,null,"","","","","","","","","","","","","","","","","","","","","","","","","","","","","","","","","","","","","","","","","","","","","","","","","","","","","","","","","","","","","","",""]
[null,null,138,0,"","","",0,0,0,"",null,null,"","","","","","","","","","","","","","","","","","","","","","","","","","","","","","","","","","","","","","","","","","","","","","","","","","","","","","","","","","","","","","",""]
[null,null,139,0,"","","",0,0,0,"",null,null,"","","","","","","","","","","","","","","","","","","","","","","","","","","","","","","","","","","","","","","","","","","","","","","","","","","","","","","","","","","","","","",""]
[null,null,140,0,"","","",0,0,0,"",null,null,"","","","","","","","","","","","","","","","","","","","","","","","","","","","","","","","","","","","","","","","","","","","","","","","","","","","","","","","","","","","","","",""]
[null,null,141,0,"","","",0,0,0,"",null,null,"","","","","","","","","","","","","","","","","","","","","","","","","","","","","","","","","","","","","","","","","","","","","","","","","","","","","","","","","","","","","","",""]
[null,null,142,0,"","","",0,0,0,"",null,null,"","","","","","","","","","","","","","","","","","","","","","","","","","","","","","","","","","","","","","","","","","","","","","","","","","","","","","","","","","","","","","",""]
[null,null,143,0,"","","",0,0,0,"",null,null,"","","","","","","","","","","","","","","","","","","","","","","","","","","","","","","","","","","","","","","","","","","","","","","","","","","","","","","","","","","","","","",""]
[null,null,144,0,"","","",0,0,0,"",null,null,"","","","","","","","","","","","","","","","","","","","","","","","","","","","","","","","","","","","","","","","","","","","","","","","","","","","","","","","","","","","","","",""]
[null,null,145,0,"","","",0,0,0,"",null,null,"","","","","","","","","","","","","","","","","","","","","","","","","","","","","","","","","","","","","","","","","","","","","","","","","","","","","","","","","","","","","","",""]
[null,null,146,0,"","","",0,0,0,"",null,null,"","","","","","","","","","","","","","","","","","","","","","","","","","","","","","","","","","","","","","","","","","","","","","","","","","","","","","","","","","","","","","",""]
[null,null,147,0,"","","",0,0,0,"",null,null,"","","","","","","","","","","","","","","","","","","","","","","","","","","","","","","","","","","","","","","","","","","","","","","","","","","","","","","","","","","","","","",""]
[null,null,148,0,"","","",0,0,0,"",null,null,"","","","","","","","","","","","","","","","","","","","","","","","","","","","","","","","","","","","","","","","","","","","","","","","","","","","","","","","","","","","","","",""]
[null,null,149,0,"","","",0,0,0,"",null,null,"","","","","","","","","","","","","","","","","","","","","","","","","","","","","","","","","","","","","","","","","","","","","","","","","","","","","","","","","","","","","","",""]
[null,null,150,0,"","","",0,0,0,"",null,null,"","","","","","","","","","","","","","","","","","","","","","","","","","","","","","","","","","","","","","","","","","","","","","","","","","","","","","","","","","","","","","",""]
[null,null,151,0,"","","",0,0,0,"",null,null,"","","","","","","","","","","","","","","","","","","","","","","","","","","","","","","","","","","","","","","","","","","","","","","","","","","","","","","","","","","","","","",""]
[null,null,152,0,"","","",0,0,0,"",null,null,"","","","","","","","","","","","","","","","","","","","","","","","","","","","","","","","","","","","","","","","","","","","","","","","","","","","","","","","","","","","","","",""]
[null,null,153,0,"","","",0,0,0,"",null,null,"","","","","","","","","","","","","","","","","","","","","","","","","","","","","","","","","","","","","","","","","","","","","","","","","","","","","","","","","","","","","","",""]
[null,null,154,0,"","","",0,0,0,"",null,null,"","","","","","","","","","","","","","","","","","","","","","","","","","","","","","","","","","","","","","","","","","","","","","","","","","","","","","","","","","","","","","",""]
[null,null,155,0,"","","",0,0,0,"",null,null,"","","","","","","","","","","","","","","","","","","","","","","","","","","","","","","","","","","","","","","","","","","","","","","","","","","","","","","","","","","","","","",""]
[null,null,156,0,"","","",0,0,0,"",null,null,"","","","","","","","","","","","","","","","","","","","","","","","","","","","","","","","","","","","","","","","","","","","","","","","","","","","","","","","","","","","","","",""]
[null,null,157,0,"","","",0,0,0,"",null,null,"","","","","","","","","","","","","","","","","","","","","","","","","","","","","","","","","","","","","","","","","","","","","","","","","","","","","","","","","","","","","","",""]
[null,null,158,0,"","","",0,0,0,"",null,null,"","","","","","","","","","","","","","","","","","","","","","","","","","","","","","","","","","","","","","","","","","","","","","","","","","","","","","","","","","","","","","",""]
[null,null,159,0,"","","",0,0,0,"",null,null,"","","","","","","","","","","","","","","","","","","","","","","","","","","","","","","","","","","","","","","","","","","","","","","","","","","","","","","","","","","","","","",""]
[null,null,160,0,"","","",0,0,0,"",null,null,"","","","","","","","","","","","","","","","","","","","","","","","","","","","","","","","","","","","","","","","","","","","","","","","","","","","","","","","","","","","","","",""]
[null,null,161,0,"","","",0,0,0,"",null,null,{"$f":"IF(C176<=$Z$9,C176,\"\")","v":""},"","","","","","","","","","","","","","","","","","","","","","","","","","","","","","","","","","","","","","","","","","","","","","","","","","","","","","","","","","","","","",""]
[null,null,162,0,"","","",0,0,0,"",null,null,"","","","","","","","","","","","","","","","","","","","","","","","","","","","","","","","","","","","","","","","","","","","","","","","","","","","","","","","","","","","","","",""]
[null,null,163,0,"","","",0,0,0,"",null,null,"","","","","","","","","","","","","","","","","","","","","","","","","","","","","","","","","","","","","","","","","","","","","","","","","","","","","","","","","","","","","","",""]
[null,null,164,0,"","","",0,0,0,"",null,null,"","","","","","","","","","","","","","","","","","","","","","","","","","","","","","","","","","","","","","","","","","","","","","","","","","","","","","","","","","","","","","",""]
[null,null,165,0,"","","",0,0,0,"",null,null,"","","","","","","","","","","","","","","","","","","","","","","","","","","","","","","","","","","","","","","","","","","","","","","","","","","","","","","","","","","","","","",""]
[null,null,166,0,"","","",0,0,0,"",null,null,"","","","","","","","","","","","","","","","","","","","","","","","","","","","","","","","","","","","","","","","","","","","","","","","","","","","","","","","","","","","","","",""]
[null,null,167,0,"","","",0,0,0,"",null,null,"","","","","","","","","","","","","","","","","","","","","","","","","","","","","","","","","","","","","","","","","","","","","","","","","","","","","","","","","","","","","","",""]
[null,null,168,0,"","","",0,0,0,"",null,null,"","","","","","","","","","","","","","","","","","","","","","","","","","","","","","","","","","","","","","","","","","","","","","","","","","","","","","","","","","","","","","",""]
[null,null,169,0,"","","",0,0,0,"",null,null,"","","","","","","","","","","","","","","","","","","","","","","","","","","","","","","","","","","","","","","","","","","","","","","","","","","","","","","","","","","","","","",""]
[null,null,170,0,"","","",0,0,0,"",null,null,"","","","","","","","","","","","","","","","","","","","","","","","","","","","","","","","","","","","","","","","","","","","","","","","","","","","","","","","","","","","","","",""]
[null,null,171,0,"","","",0,0,0,"",null,null,"","","","","","","","","","","","","","","","","","","","","","","","","","","","","","","","","","","","","","","","","","","","","","","","","","","","","","","","","","","","","","",""]
[null,null,172,0,"","","",0,0,0,"",null,null,"","","","","","","","","","","","","","","","","","","","","","","","","","","","","","","","","","","","","","","","","","","","","","","","","","","","","","","","","","","","","","",""]
[null,null,173,0,"","","",0,0,0,"",null,null,"","","","","","","","","","","","","","","","","","","","","","","","","","","","","","","","","","","","","","","","","","","","","","","","","","","","","","","","","","","","","","",""]
[null,null,174,0,"","","",0,0,0,"",null,null,"","","","","","","","","","","","","","","","","","","","","","","","","","","","","","","","","","","","","","","","","","","","","","","","","","","","","","","","","","","","","","",""]
[null,null,175,0,"","","",0,0,0,"",null,null,"","","","","","","","","","","","","","","","","","","","","","","","","","","","","","","","","","","","","","","","","","","","","","","","","","","","","","","","","","","","","","",""]
[null,null,176,0,"","","",0,0,0,"",null,null,"","","","","","","","","","","","","","","","","","","","","","","","","","","","","","","","","","","","","","","","","","","","","","","","","","","","","","","","","","","","","","",""]
[null,null,177,0,"","","",0,0,0,"",null,null,"","","","","","","","","","","","","","","","","","","","","","","","","","","","","","","","","","","","","","","","","","","","","","","","","","","","","","","","","","","","","","",""]
[null,null,178,0,"","","",0,0,0,"",null,null,"","","","","","","","","","","","","","","","","","","","","","","","","","","","","","","","","","","","","","","","","","","","","","","","","","","","","","","","","","","","","","",""]
[null,null,179,0,"","","",0,0,0,"",null,null,"","","","","","","","","","","","","","","","","","","","","","","","","","","","","","","","","","","","","","","","","","","","","","","","","","","","","","","","","","","","","","",""]
[null,null,180,0,"","","",0,0,0,"",null,null,"","","","","","","","","","","","","","","","","","","","","","","","","","","","","","","","","","","","","","","","","","","","","","","","","","","","","","","","","","","","","","",""]
[null,null,181,0,"","","",0,0,0,"",null,null,"","","","","","","","","","","","","","","","","","","","","","","","","","","","","","","","","","","","","","","","","","","","","","","","","","","","","","","","","","","","","","",""]
[null,null,182,0,"","","",0,0,0,"",null,null,"","","","","","","","","","","","","","","","","","","","","","","","","","","","","","","","","","","","","","","","","","","","","","","","","","","","","","","","","","","","","","",""]
[null,null,183,0,"","","",0,0,0,"",null,null,"","","","","","","","","","","","","","","","","","","","","","","","","","","","","","","","","","","","","","","","","","","","","","","","","","","","","","","","","","","","","","",""]
[null,null,184,0,"","","",0,0,0,"",null,null,"","","","","","","","","","","","","","","","","","","","","","","","","","","","","","","","","","","","","","","","","","","","","","","","","","","","","","","","","","","","","","",""]
[null,null,185,0,"","","",0,0,0,"",null,null,"","","","","","","","","","","","","","","","","","","","","","","","","","","","","","","","","","","","","","","","","","","","","","","","","","","","","","","","","","","","","","",""]
[null,null,186,0,"","","",0,0,0,"",null,null,"","","","","","","","","","","","","","","","","","","","","","","","","","","","","","","","","","","","","","","","","","","","","","","","","","","","","","","","","","","","","","",""]
[null,null,187,0,"","","",0,0,0,"",null,null,"","","","","","","","","","","","","","","","","","","","","","","","","","","","","","","","","","","","","","","","","","","","","","","","","","","","","","","","","","","","","","",""]
[null,null,188,0,"","","",0,0,0,"",null,null,"","","","","","","","","","","","","","","","","","","","","","","","","","","","","","","","","","","","","","","","","","","","","","","","","","","","","","","","","","","","","","",""]
[null,null,189,0,"","","",0,0,0,"",null,null,"","","","","","","","","","","","","","","","","","","","","","","","","","","","","","","","","","","","","","","","","","","","","","","","","","","","","","","","","","","","","","",""]
[null,null,190,0,"","","",0,0,0,"",null,null,"","","","","","","","","","","","","","","","","","","","","","","","","","","","","","","","","","","","","","","","","","","","","","","","","","","","","","","","","","","","","","",""]
[null,null,191,0,"","","",0,0,0,"",null,null,"","","","","","","","","","","","","","","","","","","","","","","","","","","","","","","","","","","","","","","","","","","","","","","","","","","","","","","","","","","","","","",""]
[null,null,192,0,"","","",0,0,0,"",null,null,"","","","","","","","","","","","","","","","","","","","","","","","","","","","","","","","","","","","","","","","","","","","","","","","","","","","","","","","","","","","","","",""]
[null,null,193,{"$f":"IF(AND($N208<>\"\",$Q208<>\"\"),1,0)","v":0},{"$f":"IF(ISERROR(VLOOKUP($S208,$A$17:$B$33,2,FALSE)),\"\",VLOOKUP($S208,$A$17:$B$33,2,FALSE))","v":""},{"$f":"IF(ISERROR(VLOOKUP($AB208,$A$17:$B$33,2,FALSE)),\"\",VLOOKUP($AB208,$A$17:$B$33,2,FALSE))","v":""},{"$f":"IF(ISERROR(VLOOKUP($AK208,$A$17:$B$33,2,FALSE)),\"\",VLOOKUP($AK208,$A$17:$B$33,2,FALSE))","v":""},0,0,0,"",null,null,{"$f":"IF(C208<=$Z$9,C208,\"\")","v":""},"","","","","","","","","","","","","","","","","","","","","","","","","","","","","","","","","","","","","","","","","","","","","","","","","","","","","","","","","","","","","",""]
[null,null,194,0,"","","",0,0,0,"",null,null,"","","","","","","","","","","","","","","","","","","","","","","","","","","","","","","","","","","","","","","","","","","","","","","","","","","","","","","","","","","","","","",""]
[null,null,195,0,"","","",{"$f":"IF(OR(LEFT(S210,2)=\"K0\",LEFT(S210,2)=\"T0\",LEFT(S210,2)=\"M0\",LEFT(S210,2)=\"P0\",LEFT(S210,2)=\"S0\"),1,0)","v":0},{"$f":"IF(OR(LEFT(AB210,2)=\"K0\",LEFT(AB210,2)=\"T0\",LEFT(AB210,2)=\"M0\",LEFT(AB210,2)=\"P0\",LEFT(AB210,2)=\"S0\"),1,0)","v":0},{"$f":"IF(OR(LEFT(AK210,2)=\"K0\",LEFT(AK210,2)=\"T0\",LEFT(AK210,2)=\"M0\",LEFT(AK210,2)=\"P0\",LEFT(AK210,2)=\"S0\"),1,0)","v":0},{"$f":"IF(SUM(H210:J210)>0,\"X\",\"\")","v":""},null,null,"","","","","","","","","","","","","","","","","","","","","","","","","","","","","","","","","","","","","","","","","","","","","","","","","","","","","","","","","","","","","","",""]
[null,null,196,0,"","","",0,0,0,"",null,null,"","","","","","","","","","","","","","","","","","","","","","","","","","","","","","","","","","","","","","","","","","","","","","","","","","","","","","","","","","","","","","",""]
[null,null,197,0,"","","",0,0,0,"",null,null,"","","","","","","","","","","","","","","","","","","","","","","","","","","","","","","","","","","","","","","","","","","","","","","","","","","","","","","","","","","","","","",""]
[null,null,198,0,"","","",0,0,0,"",null,null,"","","","","","","","","","","","","","","","","","","","","","","","","","","","","","","","","","","","","","","","","","","","","","","","","","","","","","","","","","","","","","",""]
[null,null,199,0,"","","",0,0,0,"",null,null,"","","","","","","","","","","","","","","","","","","","","","","","","","","","","","","","","","","","","","","","","","","","","","","","","","","","","","","","","","","","","","",""]
[null,null,200,0,"","","",0,0,0,"",null,null,"","","","","","","","","","","","","","","","","","","","","","","","","","","","","","","","","","","","","","","","","","","","","","","","","","","","","","","","","","","","","","",""]
[null,null,201,null,null,null,null,null,null,null,null,null,null," …"," …"," …"," …"," …"," …",null,null,null,null,null,null,null,null,null,null,null,null,null,null,null,null,null,null,null,null,null,null,null,null," …"," …"," …"," …"," …"," …"," …"," …"," …"," …",null,null," …"," …"," …"," …"," …"," …"," …"," …"," …"," …"," …"]
[]
[]
[]
[]
[]
[]
[]
[]
[]
[]
[]
[]
[]
[]
[]
[]
[]
[]
[]
[]
[]
[]
[]
[]
[]
[]
[]
[]
[]
[]
[]
[]
[]
[]
[]
[]
[]
[]
[]
[]
[]
[]
[]
[]
[]
[]
[]
[]
[]
[]
[]
[]
[]
[]
[]
[]
[]
[]
[]
[]
[]
[]
[]
[]
[]
[]
[]
[]
[]
[]
[]
[]
[]
[]
[]
[]
[]
[]
[]
[]
[]
[]
[]
[]
[null,"A1_ini","E0_ebe","A2_ini","A3_ini","A5_ini","E1_ebe"]
[null,0,0,3,0,0,0]
[null,1,1,4,1,1,1]
[null,2,2,5,2,2,2]
[null,null,null,null,3,3,3]
[null,null,null,null,4,4,4]
[null,null,null,null,5,5,5]
[]
[null,"B0_pri","E2_ebe","F0_sec","D1_eba","D2_eba","L0_etp"]
[null,1,1,1,"IN1",1,"AXT"]
[null,2,2,2,"IN2",2,"TEC"]
[null,3,3,3,"IT1",3]
[null,4,4,4,"IT2",4]
[null,5,5,5,"IT3"]
[null,6,6]
[]
[]
[null,null,null,null,"K0_iesp","M0_esfa","T0_iest"]
[null,null,null,null,"I","I","I"]
[null,null,null,null,"II","II","II"]
[null,null,null,null,"III","III","III"]
[null,null,null,null,"IV","IV","IV"]
[null,null,null,null,"V","V","V"]
[null,null,null,null,"VI","VI","VI"]
[null,null,null,null,"VII","VII","VII"]
[null,null,null,null,"VIII","VIII","VIII"]
[null,null,null,null,"IX","IX"]
[null,null,null,null,"X","X"]

{"sheet":"Mod07","index":7,"n_rows":216,"n_cols":132,"rows_kept":216,"cut":false,"hidden":false,"merged":[[14,8,15,8],[14,9,15,9],[13,11,15,11],[14,29,15,29],[13,27,15,27],[14,28,15,28],[13,13,13,26],[14,12,15,12],[12,31,12,32],[12,33,12,34],[13,31,13,32],[13,33,13,34],[1,10,1,22],[2,10,2,22],[12,13,12,26],[12,35,12,36],[13,35,13,36],[14,35,15,35],[14,36,15,36],[14,40,15,40],[14,37,15,37],[14,38,15,38],[14,39,15,39],[14,31,15,31],[14,32,15,32],[14,33,15,33],[14,30,15,30],[14,41,15,41],[14,34,15,34]]}
[null,null,null,null,null,{"$f":"IF('Mod05'!G22<>\"\",'Mod05'!G22,\"X\")","v":"X"}]
[null,null,null,null,null,{"$f":"IF('Mod05'!G23<>\"\",'Mod05'!G23,\"X\")","v":"X"},null,null,null,null,"CENSO EDUCATIVO 2026"]
[null,null,null,null,null,{"$f":"IF('Mod05'!G24<>\"\",'Mod05'!G24,\"X\")","v":"X"},null,null,null,null,"LOCAL EDUCATIVO"]
[null,null,null,null,null,{"$f":"IF('Mod05'!G25<>\"\",'Mod05'!G25,\"X\")","v":"X"}]
[null,null,null,null,null,{"$f":"IF('Mod05'!G26<>\"\",'Mod05'!G26,\"X\")","v":"X"}]
[null,null,null,null,null,{"$f":"IF('Mod05'!G27<>\"\",'Mod05'!G27,\"X\")","v":"X"}]
[null,null,null,null,null,{"$f":"IF('Mod05'!G28<>\"\",'Mod05'!G28,\"X\")","v":"X"},null,"CAPÍTULO 7: CARACTERÍSTICAS DE OTROS AMBIENTES EDUCATIVOS Y DE SOPORTE DISTINTOS AL AULA EN EL LOCAL EDUCATIVO"]
[null,null,null,null,null,{"$f":"IF('Mod05'!G29<>\"\",'Mod05'!G29,\"X\")","v":"X"}]
[null,null,null,null,null,{"$f":"IF('Mod05'!G30<>\"\",'Mod05'!G30,\"X\")","v":"X"},null,"SI"]
[null,null,null,null,null,{"$f":"IF('Mod05'!G31<>\"\",'Mod05'!G31,\"X\")","v":"X"},null,"NO",null,"7.1. CANTIDAD DE OTROS ESPACIOS EDUCATIVOS Y DE SOPORTE DISTINTOS AL AULA :",null,null,null,null,"( Considere a los espacios EN USO y SIN USO )"]
[null,null,null,null,null,{"$f":"IF('Mod05'!G32<>\"\",'Mod05'!G32,\"X\")","v":"X"},null,"NA"]
[null,null,null,null,null,{"$f":"IF('Mod05'!G33<>\"\",'Mod05'!G33,\"X\")","v":"X"}]
[null,null,null,null,null,{"$f":"IF('Mod05'!G34<>\"\",'Mod05'!G34,\"X\")","v":"X"},null,null,"(1)","(2)","(3)","(4)","(5)","(6)",null,null,null,null,null,null,null,null,null,null,null,null,null,"(7)","(8)","(9)","(10)","(11)",null,"(12)",null,"(13)",null,"(14)","(15)","(16)","(17)","(18)"]
[null,null,null,null,null,{"$f":"IF('Mod05'!G35<>\"\",'Mod05'!G35,\"X\")","v":"X"},null,null,null,null,null,"El ambiente ¿se encuentra en uso?","El ambiente detallado\n¿ha sido:?","Niveles educativos que usan el ambiente\nMarque con una “X”",null,null,null,null,null,null,null,null,null,null,null,null,null,"¿Cuenta con señaliza- ción de seguridad?","Puertas","Cerraduras","Ventanas","Paredes",null,"Techo",null,"Piso",null,null,null,null,null,"Pizarras"]
[null,null,null,null,null,{"$f":"IF('Mod05'!G36<>\"\",'Mod05'!G36,\"X\")","v":"X"},null,"Nº","Nº de edifica- ción","Nº de piso","Detalle del espacio",null,"01: Construido para tal fin\n02: Adaptado","N","O","P","Q","R","S","T","U","V","W","X","Y","Z","AA",null,"\n\nCantidad","\n\nCantidad","\n\nCantidad","(1)\nMaterial\npredominante","(2)\nEstado de conservación","(1)\nMaterial\npredominante","(2)\nEstado de conservación","(1)\nMaterial\npredominante","(2)\nEstado de conservación","¿Cuenta con instalaciones eléctricas?","¿Cuenta con instalaciones sanitarias?","¿Cuenta con conexión a internet?","¿Cuenta con\ninstalación\nde gas?","Cantidad\nTotal"]
["TABLA 01 - Detalle del espacio",{"$f":"SUM(B17:B166)","v":0},"Corr",{"$f":"SUM(D17:D166)","v":0},{"$f":"SUM(E17:E166)","v":0},{"$f":"IF('Mod05'!G37<>\"\",'Mod05'!G37,\"X\")","v":"X"},{"$f":"SUM(G17:G166)","v":0},null,null,null,null,null,null,"A0","B0","F0","D1","D2","E0","E1","E2","L0","K0","T0","M0","P0","S0"]
["001: SALA O AULA DE PSICOMOTRICIDAD (INICIAL O CEBE O ISP/ESP)",{"$f":"IF(OR(LEFT(K17,3)=\"063\",LEFT(K17,3)=\"064\",LEFT(K17,3)=\"065\",LEFT(K17,3)=\"066\",LEFT(K17,3)=\"067\"),1,0)","v":0},1,{"$f":"IF(OR(LEFT(K17,3)=\"011\",LEFT(K17,3)=\"012\",LEFT(K17,3)=\"013\",LEFT(K17,3)=\"014\"),1,0)","v":0},{"$f":"IF(OR(LEFT(K17,3)=\"020\",LEFT(K17,3)=\"029\",LEFT(K17,3)=\"030\",LEFT(K17,3)=\"031\",LEFT(K17,3)=\"032\",LEFT(K17,3)=\"033\"),1,0)","v":0},{"$f":"IF('Mod05'!G38<>\"\",'Mod05'!G38,\"X\")","v":"X"},{"$f":"IF(OR(LEFT(K17,3)=\"024\",LEFT(K17,3)=\"025\"),1,0)","v":0},{"$f":"IF($C17<=$M$10,C17,\"\")","v":""},"","","","","","","","","","","","","","","","","","","","","","","","","","","","","","","","","","","","","","","","","",""]
["002: AULA VIVENCIAL (CEBE)",{"$f":"IF(OR(LEFT(K18,3)=\"063\",LEFT(K18,3)=\"064\",LEFT(K18,3)=\"065\",LEFT(K18,3)=\"066\",LEFT(K18,3)=\"067\"),1,0)","v":0},2,{"$f":"IF(OR(LEFT(K18,3)=\"011\",LEFT(K18,3)=\"012\",LEFT(K18,3)=\"013\",LEFT(K18,3)=\"014\"),1,0)","v":0},{"$f":"IF(OR(LEFT(K18,3)=\"020\",LEFT(K18,3)=\"029\",LEFT(K18,3)=\"030\",LEFT(K18,3)=\"031\",LEFT(K18,3)=\"032\",LEFT(K18,3)=\"033\"),1,0)","v":0},{"$f":"IF('Mod05'!G39<>\"\",'Mod05'!G39,\"X\")","v":"X"},{"$f":"IF(OR(LEFT(K18,3)=\"024\",LEFT(K18,3)=\"025\"),1,0)","v":0},{"$f":"IF($C18<=$M$10,C18,\"\")","v":""},"","","","","","","","","","","","","","","","","","","","","","","","","","","","","","","","","",""]
["003: SALA EDUCATIVA (PRITE)",0,3,0,0,{"$f":"IF('Mod05'!G40<>\"\",'Mod05'!G40,\"X\")","v":"X"},{"$f":"IF(OR(LEFT(K19,3)=\"024\",LEFT(K19,3)=\"025\"),1,0)","v":0},{"$f":"IF($C19<=$M$10,C19,\"\")","v":""},"","","","","","","","","","","","","","","","","","","","","","","","","","","","","","","","","",""]
["321: OTRO ESPACIO TIPO -A- O SIMILARES CARACTERÍSTICAS",0,4,0,0,{"$f":"IF('Mod05'!G41<>\"\",'Mod05'!G41,\"X\")","v":"X"},0,"","","","","","","","","","","","","","","","","","","","","","","","","","","","","","","","","","",""]
["004: SALA DE USOS MÚLTIPLES (SUM)",0,5,0,0,{"$f":"IF('Mod05'!G42<>\"\",'Mod05'!G42,\"X\")","v":"X"},0,"","","","","","","","","","","","","","","","","","","","","","","","","","","","","","","","","","","","","","","","","","","","","","","","","","","","","","","","","","","","","","","","","","","","","","","","","","","","","","","","","","","","","","","","","","","","","","","","","","","","","","","","","","","","","","","","","","","","","","","","","","","","",""]
["005: AUDITORIO",0,6,0,0,{"$f":"IF('Mod05'!G43<>\"\",'Mod05'!G43,\"X\")","v":"X"},0,"","","","","","","","","","","","","","","","","","","","","","","","","","","","","","","","","","","","","","","","","","","","","","","","","","","","","","","","","","","","","","","","","","","","","","","","","","","","","","","","","","","","","","","","","","","","","","","","","","","","","","","","","","","","","","","","","","","","","","","","","","","","",""]
["006: SALA DE DANZA (ESFA)",0,7,0,0,{"$f":"IF('Mod05'!G44<>\"\",'Mod05'!G44,\"X\")","v":"X"},0,"","","","","","","","","","","","","","","","","","","","","","","","","","","","","","","","","","","","","","","","","","","","","","","","","","","","","","","","","","","","","","","","","","","","","","","","","","","","","","","","","","","","","","","","","","","","","","","","","","","","","","","","","","","","","","","","","","","","","","","","","","","","",""]
["007: SALA O TALLER DE MÚSICA (SECUNDARIA O ESFA) ",0,8,0,0,{"$f":"IF('Mod05'!G45<>\"\",'Mod05'!G45,\"X\")","v":"X"},0,"","","","","","","","","","","","","","","","","","","","","","","","","","","","","","","","","","","","","","","","","","","","","","","","","","","","","","","","","","","","","","","","","","","","","","","","","","","","","","","","","","","","","","","","","","","","","","","","","","","","","","","","","","","","","","","","","","","","","","","","","","","","",""]
["008: SALA DE DANZAS FOLCLÓRICAS (ESFA)",0,9,0,0,{"$f":"IF('Mod05'!G46<>\"\",'Mod05'!G46,\"X\")","v":"X"},0,"","","","","","","","","","","","","","","","","","","","","","","","","","","","","","","","","","","","","","","","","","","","","","","","","","","","","","","","","","","","","","","","","","","","","","","","","","","","","","","","","","","","","","","","","","","","","","","","","","","","","","","","","","","","","","","","","","","","","","","","","","","","",""]
["009: SALA DE BALLET (ESFA)",0,10,0,0,{"$f":"IF('Mod05'!G47<>\"\",'Mod05'!G47,\"X\")","v":"X"},0,"","","","","","","","","","","","","","","","","","","","","","","","","","","","","","","","","","","","","","","","","","","","","","","","","","","","","","","","","","","","","","","","","","","","","","","","","","","","","","","","","","","","","","","","","","","","","","","","","","","","","","","","","","","","","","","","","","","","","","","","","","","","",""]
["010: OTRO ESPACIO DE TIPO -D- O SIMILARES CARACTERÍSTICAS",0,11,0,0,{"$f":"IF('Mod05'!G48<>\"\",'Mod05'!G48,\"X\")","v":"X"},0,"","","","","","","","","","","","","","","","","","","","","","","","","","","","","","","","","","","","","","","","","","","","","","","","","","","","","","","","","","","","","","","","","","","","","","","","","","","","","","","","","","","","","","","","","","","","","","","","","","","","","","","","","","","","","","","","","","","","","","","","","","","","",""]
["011: BIBLIOTECA TIPO I – 75 M2 O MENOS (PRIMARIA Y SECUNDARIA)",0,12,0,0,{"$f":"IF('Mod05'!G49<>\"\",'Mod05'!G49,\"X\")","v":"X"},0,"","","","","","","","","","","","","","","","","","","","","","","","","","","","","","","","","","","","","","","","","","","","","","","","","","","","","","","","","","","","","","","","","","","","","","","","","","","","","","","","","","","","","","","","","","","","","","","","","","","","","","","","","","","","","","","","","","","","","","","","","","","","",""]
["012: BIBLIOTECA TIPO II – 90 M2 (PRIMARIA Y SECUNDARIA)",0,13,0,0,{"$f":"IF('Mod05'!G50<>\"\",'Mod05'!G50,\"X\")","v":"X"},0,"","","","","","","","","","","","","","","","","","","","","","","","","","","","","","","","","","","","","","","","","","","","","","","","","","","","","","","","","","","","","","","","","","","","","","","","","","","","","","","","","","","","","","","","","","","","","","","","","","","","","","","","","","","","","","","","","","","","","","","","","","","","",""]
["013: BIBLIOTECA TIPO III – 120 M2 O MÁS (PRIMARIA Y SECUNDARIA)",0,14,0,0,{"$f":"IF('Mod05'!G51<>\"\",'Mod05'!G51,\"X\")","v":"X"},0,"","","","","","","","","","","","","","","","","","","","","","","","","","","","","","","","","","","","","","","","","","","","","","","","","","","","","","","","","","","","","","","","","","","","","","","","","","","","","","","","","","","","","","","","","","","","","","","","","","","","","","","","","","","","","","","","","","","","","","","","","","","","",""]
["014: BIBLIOTECA DE EDUCACIÓN SUPERIOR O TÉCNICO PRODUCTIVA",0,15,0,0,{"$f":"IF('Mod05'!G52<>\"\",'Mod05'!G52,\"X\")","v":"X"},0,"","","","","","","","","","","","","","","","","","","","","","","","","","","","","","","","","","","","","","","","","","","","","","","","","","","","","","","","","","","","","","","","","","","","","","","","","","","","","","","","","","","","","","","","","","","","","","","","","","","","","","","","","","","","","","","","","","","","","","","","","","","","",""]
["015: AULA DE INNOVACIÓN PEDAGÓGICA (PRIMARIA Y SECUNDARIA",0,16,0,0,{"$f":"IF('Mod05'!G53<>\"\",'Mod05'!G53,\"X\")","v":"X"},0,"","","","","","","","","","","","","","","","","","","","","","","","","","","","","","","","","","","","","","","","","","","","","","","","","","","","","","","","","","","","","","","","","","","","","","","","","","","","","","","","","","","","","","","","","","","","","","","","","","","","","","","","","","","","","","","","","","","","","","","","","","","","",""]
["016: AULA DE CÓMPUTO - IDIOMAS (ED. SUPERIOR TECNOLÓGICO O ARTÍSTICO O ETP)",0,17,0,0,{"$f":"IF('Mod05'!G54<>\"\",'Mod05'!G54,\"X\")","v":"X"},0,"","","","","","","","","","","","","","","","","","","","","","","","","","","","","","","","","","","","","","","","","","","","","","","","","","","","","","","","","","","","","","","","","","","","","","","","","","","","","","","","","","","","","","","","","","","","","","","","","","","","","","","","","","","","","","","","","","","","","","","","","","","","",""]
["017: AULA O CENTRO DE CÓMPUTO (ED. SUPERIOR PEDAGÓGICO)",0,18,0,0,{"$f":"IF('Mod05'!G55<>\"\",'Mod05'!G55,\"X\")","v":"X"},0,"","","","","","","","","","","","","","","","","","","","","","","","","","","","","","","","","","","","","","","","","","","","","","","","","","","","","","","","","","","","","","","","","","","","","","","","","","","","","","","","","","","","","","","","","","","","","","","","","","","","","","","","","","","","","","","","","","","","","","","","","","","","",""]
["018: CENTRO DE RECURSOS (ED. SUPERIOR O ETP)",0,19,0,0,{"$f":"IF('Mod05'!G56<>\"\",'Mod05'!G56,\"X\")","v":"X"},0,"","","","","","","","","","","","","","","","","","","","","","","","","","","","","","","","","","","","","","","","","","","","","","","","","","","","","","","","","","","","","","","","","","","","","","","","","","","","","","","","","","","","","","","","","","","","","","","","","","","","","","","","","","","","","","","","","","","","","","","","","","","","",""]
["019: OTRO ESPACIO DE TIPO -B- O SIMILARES CARACTERÍSTICAS",0,20,0,0,{"$f":"IF('Mod05'!G57<>\"\",'Mod05'!G57,\"X\")","v":"X"},0,"","","","","","","","","","","","","","","","","","","","","","","","","","","","","","","","","","","","","","","","","","","","","","","","","","","","","","","","","","","","","","","","","","","","","","","","","","","","","","","","","","","","","","","","","","","","","","","","","","","","","","","","","","","","","","","","","","","","","","","","","","","","",""]
["020: LABORATORIO DE CIENCIA Y TECNOLOGÍA (SECUNDARIA )",0,21,0,0,{"$f":"IF('Mod05'!G58<>\"\",'Mod05'!G58,\"X\")","v":"X"},0,"","","","","","","","","","","","","","","","","","","","","","","","","","","","","","","","","","","","","","","","","","","","","","","","","","","","","","","","","","","","","","","","","","","","","","","","","","","","","","","","","","","","","","","","","","","","","","","","","","","","","","","","","","","","","","","","","","","","","","","","","","","","",""]
["021: TALLER CREATIVO (PRIMARIA)",0,22,0,0,{"$f":"IF('Mod05'!G59<>\"\",'Mod05'!G59,\"X\")","v":"X"},0,"","","","","","","","","","","","","","","","","","","","","","","","","","","","","","","","","","","","","","","","","","","","","","","","","","","","","","","","","","","","","","","","","","","","","","","","","","","","","","","","","","","","","","","","","","","","","","","","","","","","","","","","","","","","","","","","","","","","","","","","","","","","",""]
["022: TALLER DE ARTES ESCÉNICAS (CEBE)",0,23,0,0,{"$f":"IF('Mod05'!G60<>\"\",'Mod05'!G60,\"X\")","v":"X"},0,"","","","","","","","","","","","","","","","","","","","","","","","","","","","","","","","","","","","","","","","","","","","","","","","","","","","","","","","","","","","","","","","","","","","","","","","","","","","","","","","","","","","","","","","","","","","","","","","","","","","","","","","","","","","","","","","","","","","","","","","","","","","",""]
["023: TALLER DE ARTE O CERÁMICA (SECUNDARIA O CEBE)",0,24,0,0,{"$f":"IF('Mod05'!G61<>\"\",'Mod05'!G61,\"X\")","v":"X"},0,"","","","","","","","","","","","","","","","","","","","","","","","","","","","","","","","","","","","","","","","","","","","","","","","","","","","","","","","","","","","","","","","","","","","","","","","","","","","","","","","","","","","","","","","","","","","","","","","","","","","","","","","","","","","","","","","","","","","","","","","","","","","",""]
["024: TALLER DE EDUCACIÓN PARA EL TRABAJO",0,25,0,0,{"$f":"IF('Mod05'!G62<>\"\",'Mod05'!G62,\"X\")","v":"X"},0,"","","","","","","","","","","","","","","","","","","","","","","","","","","","","","","","","","","","","","","","","","","","","","","","","","","","","","","","","","","","","","","","","","","","","","","","","","","","","","","","","","","","","","","","","","","","","","","","","","","","","","","","","","","","","","","","","","","","","","","","","","","","",""]
["025: TALLER DE EDUCACIÓN PARA EL TRABAJO CON ESPECIALIDAD (CONFORMACIÓN TÉCNICA)",0,26,0,0,{"$f":"IF('Mod05'!G63<>\"\",'Mod05'!G63,\"X\")","v":"X"},0,"","","","","","","","","","","","","","","","","","","","","","","","","","","","","","","","","","","","","","","","","","","","","","","","","","","","","","","","","","","","","","","","","","","","","","","","","","","","","","","","","","","","","","","","","","","","","","","","","","","","","","","","","","","","","","","","","","","","","","","","","","","","",""]
["026: TALLER DE REPOSTERÍA Y COCINA (CEBE)",0,27,0,0,{"$f":"IF('Mod05'!G64<>\"\",'Mod05'!G64,\"X\")","v":"X"},0,"","","","","","","","","","","","","","","","","","","","","","","","","","","","","","","","","","","","","","","","","","","","","","","","","","","","","","","","","","","","","","","","","","","","","","","","","","","","","","","","","","","","","","","","","","","","","","","","","","","","","","","","","","","","","","","","","","","","","","","","","","","","",""]
["027: OTRO ESPACIO DE TIPO -C- O SIMILARES CARACTERÍSTICAS PARA ED. BÁSICA",0,28,0,0,{"$f":"IF('Mod05'!G65<>\"\",'Mod05'!G65,\"X\")","v":"X"},0,"","","","","","","","","","","","","","","","","","","","","","","","","","","","","","","","","","","","","","","","","","","","","","","","","","","","","","","","","","","","","","","","","","","","","","","","","","","","","","","","","","","","","","","","","","","","","","","","","","","","","","","","","","","","","","","","","","","","","","","","","","","","",""]
["028: LABORATORIO DE IDIOMAS",0,29,0,0,{"$f":"IF('Mod05'!G66<>\"\",'Mod05'!G66,\"X\")","v":"X"},0,"","","","","","","","","","","","","","","","","","","","","","","","","","","","","","","","","","","","","","","","","","","","","","","","","","","","","","","","","","","","","","","","","","","","","","","","","","","","","","","","","","","","","","","","","","","","","","","","","","","","","","","","","","","","","","","","","","","","","","","","","","","","",""]
["029: LABORATORIO DE CIENCIAS",0,30,0,0,{"$f":"IF('Mod05'!G67<>\"\",'Mod05'!G67,\"X\")","v":"X"},0,"","","","","","","","","","","","","","","","","","","","","","","","","","","","","","","","","","","","","","","","","","","","","","","","","","","","","","","","","","","","","","","","","","","","","","","","","","","","","","","","","","","","","","","","","","","","","","","","","","","","","","","","","","","","","","","","","","","","","","","","","","","","",""]
["030: LABORATORIO MULTIFUNCIONAL , BIOQUÍMICA , MICROBIOLOGÍA, HEMATOLOGÍA E INMUNOHEMATOLOGÍA",0,31,0,0,{"$f":"IF('Mod05'!G68<>\"\",'Mod05'!G68,\"X\")","v":"X"},0,"","","","","","","","","","","","","","","","","","","","","","","","","","","","","","","","","","","","","","","","","","","","","","","","","","","","","","","","","","","","","","","","","","","","","","","","","","","","","","","","","","","","","","","","","","","","","","","","","","","","","","","","","","","","","","","","","","","","","","","","","","","","",""]
["031: LABORATORIO DE FARMACIA",0,32,0,0,{"$f":"IF('Mod05'!G69<>\"\",'Mod05'!G69,\"X\")","v":"X"},0,"","","","","","","","","","","","","","","","","","","","","","","","","","","","","","","","","","","","","","","","","","","","","","","","","","","","","","","","","","","","","","","","","","","","","","","","","","","","","","","","","","","","","","","","","","","","","","","","","","","","","","","","","","","","","","","","","","","","","","","","","","","","",""]
["032: LABORATORIO DE SUELOS",0,33,0,0,{"$f":"IF('Mod05'!G70<>\"\",'Mod05'!G70,\"X\")","v":"X"},0,"","","","","","","","","","","","","","","","","","","","","","","","","","","","","","","","","","","","","","","","","","","","","","","","","","","","","","","","","","","","","","","","","","","","","","","","","","","","","","","","","","","","","","","","","","","","","","","","","","","","","","","","","","","","","","","","","","","","","","","","","","","","",""]
["033: LABORATORIO DE CONTROL DE CALIDAD",0,34,0,0,{"$f":"IF('Mod05'!G71<>\"\",'Mod05'!G71,\"X\")","v":"X"},0,"","","","","","","","","","","","","","","","","","","","","","","","","","","","","","","","","","","","","","","","","","","","","","","","","","","","","","","","","","","","","","","","","","","","","","","","","","","","","","","","","","","","","","","","","","","","","","","","","","","","","","","","","","","","","","","","","","","","","","","","","","","","",""]
["034: OTROS TIPOS DE LABORATORIOS PARA ED.SUPERIOR O ETP",0,35,0,0,{"$f":"IF('Mod05'!G72<>\"\",'Mod05'!G72,\"X\")","v":"X"},0,"","","","","","","","","","","","","","","","","","","","","","","","","","","","","","","","","","","","","","","","","","","","","","","","","","","","","","","","","","","","","","","","","","","","","","","","","","","","","","","","","","","","","","","","","","","","","","","","","","","","","","","","","","","","","","","","","","","","","","","","","","","","",""]
["035: TALLER DE EDUCACIÓN PARA EL TRABAJO (EPT)",0,36,0,0,{"$f":"IF('Mod05'!G73<>\"\",'Mod05'!G73,\"X\")","v":"X"},0,"","","","","","","","","","","","","","","","","","","","","","","","","","","","","","","","","","","","","","","","","","","","","","","","","","","","","","","","","","","","","","","","","","","","","","","","","","","","","","","","","","","","","","","","","","","","","","","","","","","","","","","","","","","","","","","","","","","","","","","","","","","","",""]
["036: TALLER DE INFORMÁTICA",0,37,0,0,{"$f":"IF('Mod05'!G74<>\"\",'Mod05'!G74,\"X\")","v":"X"},0,"","","","","","","","","","","","","","","","","","","","","","","","","","","","","","","","","","","","","","","","","","","","","","","","","","","","","","","","","","","","","","","","","","","","","","","","","","","","","","","","","","","","","","","","","","","","","","","","","","","","","","","","","","","","","","","","","","","","","","","","","","","","",""]
["037: TALLER DE CORTE, PEINADO, LACEADO Y TINTADO DE CABELLO",0,38,0,0,{"$f":"IF('Mod05'!G75<>\"\",'Mod05'!G75,\"X\")","v":"X"},0,"","","","","","","","","","","","","","","","","","","","","","","","","","","","","","","","","","","","","","","","","","","","","","","","","","","","","","","","","","","","","","","","","","","","","","","","","","","","","","","","","","","","","","","","","","","","","","","","","","","","","","","","","","","","","","","","","","","","","","","","","","","","",""]
["038: TALLER DE PODOESTÉTICA",0,39,0,0,{"$f":"IF('Mod05'!G76<>\"\",'Mod05'!G76,\"X\")","v":"X"},0,"","","","","","","","","","","","","","","","","","","","","","","","","","","","","","","","","","","","","","","","","","","","","","","","","","","","","","","","","","","","","","","","","","","","","","","","","","","","","","","","","","","","","","","","","","","","","","","","","","","","","","","","","","","","","","","","","","","","","","","","","","","","",""]
["039: TALLER DE LOCUCIÓN RADIAL",0,40,0,0,{"$f":"IF('Mod05'!G77<>\"\",'Mod05'!G77,\"X\")","v":"X"},0,"","","","","","","","","","","","","","","","","","","","","","","","","","","","","","","","","","","","","","","","","","","","","","","","","","","","","","","","","","","","","","","","","","","","","","","","","","","","","","","","","","","","","","","","","","","","","","","","","","","","","","","","","","","","","","","","","","","","","","","","","","","","",""]
["040: TALLER DE RECEPCIÓN HOTELERA",0,41,0,0,{"$f":"IF('Mod05'!G78<>\"\",'Mod05'!G78,\"X\")","v":"X"},0,"","","","","","","","","","","","","","","","","","","","","","","","","","","","","","","","","","","","","","","","","","","","","","","","","","","","","","","","","","","","","","","","","","","","","","","","","","","","","","","","","","","","","","","","","","","","","","","","","","","","","","","","","","","","","","","","","","","","","","","","","","","","",""]
["041: TALLER DE HOTELERÍA",0,42,0,0,{"$f":"IF('Mod05'!G79<>\"\",'Mod05'!G79,\"X\")","v":"X"},0,"","","","","","","","","","","","","","","","","","","","","","","","","","","","","","","","","","","","","","","","","","","","","","","","","","","","","","","","","","","","","","","","","","","","","","","","","","","","","","","","","","","","","","","","","","","","","","","","","","","","","","","","","","","","","","","","","","","","","","","","","","","","",""]
["042: TALLER DE NEUMÁTICA E HIDRÁULICA",0,43,0,0,{"$f":"IF('Mod05'!G80<>\"\",'Mod05'!G80,\"X\")","v":"X"},0,"","","","","","","","","","","","","","","","","","","","","","","","","","","","","","","","","","","","","","","","","","","","","","","","","","","","","","","","","","","","","","","","","","","","","","","","","","","","","","","","","","","","","","","","","","","","","","","","","","","","","","","","","","","","","","","","","","","","","","","","","","","","",""]
["043: TALLER DE CIRCUITOS ELÉCTRICOS Y/O ELECTRÓNICOS",0,44,0,0,{"$f":"IF('Mod05'!G81<>\"\",'Mod05'!G81,\"X\")","v":"X"},0,"","","","","","","","","","","","","","","","","","","","","","","","","","","","","","","","","","","","","","","","","","","","","","","","","","","","","","","","","","","","","","","","","","","","","","","","","","","","","","","","","","","","","","","","","","","","","","","","","","","","","","","","","","","","","","","","","","","","","","","","","","","","",""]
["044: TALLER DE COCINA",0,45,0,0,{"$f":"IF('Mod05'!G82<>\"\",'Mod05'!G82,\"X\")","v":"X"},0,"","","","","","","","","","","","","","","","","","","","","","","","","","","","","","","","","","","","","","","","","","","","","","","","","","","","","","","","","","","","","","","","","","","","","","","","","","","","","","","","","","","","","","","","","","","","","","","","","","","","","","","","","","","","","","","","","","","","","","","","","","","","",""]
["045: TALLER DE REPOSTERÍA",0,46,0,0,{"$f":"IF('Mod05'!G83<>\"\",'Mod05'!G83,\"X\")","v":"X"},0,"","","","","","","","","","","","","","","","","","","","","","","","","","","","","","","","","","","","","","","","","","","","","","","","","","","","","","","","","","","","","","","","","","","","","","","","","","","","","","","","","","","","","","","","","","","","","","","","","","","","","","","","","","","","","","","","","","","","","","","","","","","","",""]
["046: TALLER DE BAR Y COCTELERÍA",0,47,0,0,{"$f":"IF('Mod05'!G84<>\"\",'Mod05'!G84,\"X\")","v":"X"},0,"","","","","","","","","","","","","","","","","","","","","","","","","","","","","","","","","","","","","","","","","","","","","","","","","","","","","","","","","","","","","","","","","","","","","","","","","","","","","","","","","","","","","","","","","","","","","","","","","","","","","","","","","","","","","","","","","","","","","","","","","","","","",""]
["047: TALLER DE HOSPITALIZACIÓN",0,48,0,0,{"$f":"IF('Mod05'!G85<>\"\",'Mod05'!G85,\"X\")","v":"X"},0,"","","","","","","","","","","","","","","","","","","","","","","","","","","","","","","","","","","","","","","","","","","","","","","","","","","","","","","","","","","","","","","","","","","","","","","","","","","","","","","","","","","","","","","","","","","","","","","","","","","","","","","","","","","","","","","","","","","","","","","","","","","","",""]
["048: TALLER DE TERAPIA (MOTRICIDAD, SENSORIAL, AUDIOVISUAL, LENGUAJE, ENTRE OTROS)",0,49,0,0,{"$f":"IF('Mod05'!G86<>\"\",'Mod05'!G86,\"X\")","v":"X"},0,"","","","","","","","","","","","","","","","","","","","","","","","","","","","","","","","","","","","","","","","","","","","","","","","","","","","","","","","","","","","","","","","","","","","","","","","","","","","","","","","","","","","","","","","","","","","","","","","","","","","","","","","","","","","","","","","","","","","","","","","","","","","",""]
["049: TALLER DE DIBUJO TÉCNICO",0,50,0,0,{"$f":"IF('Mod05'!G87<>\"\",'Mod05'!G87,\"X\")","v":"X"},0,"","","","","","","","","","","","","","","","","","","","","","","","","","","","","","","","","","","","","","","","","","","","","","","","","","","","","","","","","","","","","","","","","","","","","","","","","","","","","","","","","","","","","","","","","","","","","","","","","","","","","","","","","","","","","","","","","","","","","","","","","","","","",""]
["050: TALLER DE CORTE, CONFECCIÓN Y PATRONAJE",0,51,0,0,{"$f":"IF('Mod05'!G88<>\"\",'Mod05'!G88,\"X\")","v":"X"},0,"","","","","","","","","","","","","","","","","","","","","","","","","","","","","","","","","","","","","","","","","","","","","","","","","","","","","","","","","","","","","","","","","","","","","","","","","","","","","","","","","","","","","","","","","","","","","","","","","","","","","","","","","","","","","","","","","","","","","","","","","","","","",""]
["051: TALLER DE ESCULTURA",0,52,0,0,{"$f":"IF('Mod05'!G89<>\"\",'Mod05'!G89,\"X\")","v":"X"},0,"","","","","","","","","","","","","","","","","","","","","","","","","","","","","","","","","","","","","","","","","","","","","","","","","","","","","","","","","","","","","","","","","","","","","","","","","","","","","","","","","","","","","","","","","","","","","","","","","","","","","","","","","","","","","","","","","","","","","","","","","","","","",""]
["052: TALLER PINTURA",0,53,0,0,{"$f":"IF('Mod05'!G90<>\"\",'Mod05'!G90,\"X\")","v":"X"},0,"","","","","","","","","","","","","","","","","","","","","","","","","","","","","","","","","","","","","","","","","","","","","","","","","","","","","","","","","","","","","","","","","","","","","","","","","","","","","","","","","","","","","","","","","","","","","","","","","","","","","","","","","","","","","","","","","","","","","","","","","","","","",""]
["053: TALLER DE DIBUJO",0,54,0,0,{"$f":"IF('Mod05'!G91<>\"\",'Mod05'!G91,\"X\")","v":"X"},0,"","","","","","","","","","","","","","","","","","","","","","","","","","","","","","","","","","","","","","","","","","","","","","","","","","","","","","","","","","","","","","","","","","","","","","","","","","","","","","","","","","","","","","","","","","","","","","","","","","","","","","","","","","","","","","","","","","","","","","","","","","","","",""]
["054: TALLER DE MEDICIONES ELÉCTRICAS",0,55,0,0,{"$f":"IF('Mod05'!G92<>\"\",'Mod05'!G92,\"X\")","v":"X"},0,"","","","","","","","","","","","","","","","","","","","","","","","","","","","","","","","","","","","","","","","","","","","","","","","","","","","","","","","","","","","","","","","","","","","","","","","","","","","","","","","","","","","","","","","","","","","","","","","","","","","","","","","","","","","","","","","","","","","","","","","","","","","",""]
["055: TALLER DE MOTORES DE VEHÍCULOS",0,56,0,0,{"$f":"IF('Mod05'!G93<>\"\",'Mod05'!G93,\"X\")","v":"X"},0,"","","","","","","","","","","","","","","","","","","","","","","","","","","","","","","","","","","","","","","","","","","","","","","","","","","","","","","","","","","","","","","","","","","","","","","","","","","","","","","","","","","","","","","","","","","","","","","","","","","","","","","","","","","","","","","","","","","","","","","","","","","","",""]
["056: TALLER DE MECÁNICA DE BANCO, SOLDADURA Y RECTIFICACIONES AUTOMOTRICES",0,57,0,0,{"$f":"IF('Mod05'!G94<>\"\",'Mod05'!G94,\"X\")","v":"X"},0,"","","","","","","","","","","","","","","","","","","","","","","","","","","","","","","","","","","","","","","","","","","","","","","","","","","","","","","","","","","","","","","","","","","","","","","","","","","","","","","","","","","","","","","","","","","","","","","","","","","","","","","","","","","","","","","","","","","","","","","","","","","","",""]
["057: TALLER DE TRANSMISIÓN DE VEHÍCULOS",0,58,0,0,{"$f":"IF('Mod05'!G95<>\"\",'Mod05'!G95,\"X\")","v":"X"},0,"","","","","","","","","","","","","","","","","","","","","","","","","","","","","","","","","","","","","","","","","","","","","","","","","","","","","","","","","","","","","","","","","","","","","","","","","","","","","","","","","","","","","","","","","","","","","","","","","","","","","","","","","","","","","","","","","","","","","","","","","","","","",""]
["058: TALLER DE SOLDADURA",0,59,0,0,{"$f":"IF('Mod05'!G96<>\"\",'Mod05'!G96,\"X\")","v":"X"},0,"","","","","","","","","","","","","","","","","","","","","","","","","","","","","","","","","","","","","","","","","","","","","","","","","","","","","","","","","","","","","","","","","","","","","","","","","","","","","","","","","","","","","","","","","","","","","","","","","","","","","","","","","","","","","","","","","","","","","","","","","","","","",""]
["059: TALLER DE INSTALACIONES ELÉCTRICAS",0,60,0,0,{"$f":"IF('Mod05'!G97<>\"\",'Mod05'!G97,\"X\")","v":"X"},0,"","","","","","","","","","","","","","","","","","","","","","","","","","","","","","","","","","","","","","","","","","","","","","","","","","","","","","","","","","","","","","","","","","","","","","","","","","","","","","","","","","","","","","","","","","","","","","","","","","","","","","","","","","","","","","","","","","","","","","","","","","","","",""]
["060: TALLER DE INSTALACIONES SANITARIAS",0,61,0,0,{"$f":"IF('Mod05'!G98<>\"\",'Mod05'!G98,\"X\")","v":"X"},0,"","","","","","","","","","","","","","","","","","","","","","","","","","","","","","","","","","","","","","","","","","","","","","","","","","","","","","","","","","","","","","","","","","","","","","","","","","","","","","","","","","","","","","","","","","","","","","","","","","","","","","","","","","","","","","","","","","","","","","","","","","","","",""]
["061: TALLER DE JOYERÍA",0,62,0,0,{"$f":"IF('Mod05'!G99<>\"\",'Mod05'!G99,\"X\")","v":"X"},0,"","","","","","","","","","","","","","","","","","","","","","","","","","","","","","","","","","","","","","","","","","","","","","","","","","","","","","","","","","","","","","","","","","","","","","","","","","","","","","","","","","","","","","","","","","","","","","","","","","","","","","","","","","","","","","","","","","","","","","","","","","","","",""]
["062: OTROS TIPOS DE TALLERES PARA ED.SUPERIOR O ETP",0,63,0,0,{"$f":"IF('Mod05'!G100<>\"\",'Mod05'!G100,\"X\")","v":"X"},0,"","","","","","","","","","","","","","","","","","","","","","","","","","","","","","","","","","","","","","","","","","","","","","","","","","","","","","","","","","","","","","","","","","","","","","","","","","","","","","","","","","","","","","","","","","","","","","","","","","","","","","","","","","","","","","","","","","","","","","","","","","","","",""]
["063: GIMNASIO (ED.BÁSICA)",0,64,0,0,{"$f":"IF('Mod05'!G101<>\"\",'Mod05'!G101,\"X\")","v":"X"},0,"","","","","","","","","","","","","","","","","","","","","","","","","","","","","","","","","","","","","","","","","","","","","","","","","","","","","","","","","","","","","","","","","","","","","","","","","","","","","","","","","","","","","","","","","","","","","","","","","","","","","","","","","","","","","","","","","","","","","","","","","","","","",""]
["064: COLISEO POLIDEPORTIVO O SIMILAR (ED.BÁSICA)",0,65,0,0,{"$f":"IF('Mod05'!G102<>\"\",'Mod05'!G102,\"X\")","v":"X"},0,"","","","","","","","","","","","","","","","","","","","","","","","","","","","","","","","","","","","","","","","","","","","","","","","","","","","","","","","","","","","","","","","","","","","","","","","","","","","","","","","","","","","","","","","","","","","","","","","","","","","","","","","","","","","","","","","","","","","","","","","","","","","",""]
["065: PISCINA SEMIOLÍMPICA (ED.BÁSICA)",{"$f":"IF(OR(LEFT(K82,3)=\"063\",LEFT(K82,3)=\"064\",LEFT(K82,3)=\"065\",LEFT(K82,3)=\"066\",LEFT(K82,3)=\"067\"),1,0)","v":0},66,{"$f":"IF(OR(LEFT(K82,3)=\"011\",LEFT(K82,3)=\"012\",LEFT(K82,3)=\"013\",LEFT(K82,3)=\"014\"),1,0)","v":0},{"$f":"IF(OR(LEFT(K82,3)=\"020\",LEFT(K82,3)=\"029\",LEFT(K82,3)=\"030\",LEFT(K82,3)=\"031\",LEFT(K82,3)=\"032\",LEFT(K82,3)=\"033\"),1,0)","v":0},{"$f":"IF('Mod05'!G103<>\"\",'Mod05'!G103,\"X\")","v":"X"},0,"","","","","","","","","","","","","","","","","","","","","","","","","","","","","","","","","","","","","","","","","","","","","","","","","","","","","","","","","","","","","","","","","","","","","","","","","","","","","","","","","","","","","","","","","","","","","","","","","","","","","","","","","","","","","","","","","","","","","","","","","","","","",""]
["066: PISCINA OLÍMPICA TECHADA (ED.BÁSICA)",0,67,0,0,{"$f":"IF('Mod05'!G104<>\"\",'Mod05'!G104,\"X\")","v":"X"},{"$f":"IF(OR(LEFT(K83,3)=\"024\",LEFT(K83,3)=\"025\"),1,0)","v":0},{"$f":"IF($C83<=$M$10,C83,\"\")","v":""},"","","","","","","","","","","","","","","","","","","","","","","","","","","","","","","","","","","","","","","","","","","","","","","","","","","","","","","","","","","","","","","","","","","","","","","","","","","","","","","","","","","","","","","","","","","","","","","","","","","","","","","","","","","","","","","","","","","","","","","","","","","",""]
["067: OTRO ESPACIO DEPORTIVO CERRADO",0,68,0,0,{"$f":"IF('Mod05'!G105<>\"\",'Mod05'!G105,\"X\")","v":"X"},0,"","","","","","","","","","","","","","","","","","","","","","","","","","","","","","","","","","","","","","","","","","","","","","","","","","","","","","","","","","","","","","","","","","","","","","","","","","","","","","","","","","","","","","","","","","","","","","","","","","","","","","","","","","","","","","","","","","","","","","","","","","","","",""]
["068: QUIOSCO",0,69,0,0,{"$f":"IF('Mod05'!G106<>\"\",'Mod05'!G106,\"X\")","v":"X"},0,"","","","","","","","","","","","","","","","","","","","","","","","","","","","","","","","","","","","","","","","","","","","","","","","","","","","","","","","","","","","","","","","","","","","","","","","","","","","","","","","","","","","","","","","","","","","","","","","","","","","","","","","","","","","","","","","","","","","","","","","","","","","",""]
["069: CAFETERÍA",0,70,0,0,{"$f":"IF('Mod05'!G107<>\"\",'Mod05'!G107,\"X\")","v":"X"},0,"","","","","","","","","","","","","","","","","","","","","","","","","","","","","","","","","","","","","","","","","","","","","","","","","","","","","","","","","","","","","","","","","","","","","","","","","","","","","","","","","","","","","","","","","","","","","","","","","","","","","","","","","","","","","","","","","","","","","","","","","","","","",""]
["070: COMEDOR",0,71,0,0,{"$f":"IF('Mod05'!G108<>\"\",'Mod05'!G108,\"X\")","v":"X"},0,"","","","","","","","","","","","","","","","","","","","","","","","","","","","","","","","","","","","","","","","","","","","","","","","","","","","","","","","","","","","","","","","","","","","","","","","","","","","","","","","","","","","","","","","","","","","","","","","","","","","","","","","","","","","","","","","","","","","","","","","","","","","",""]
["071: COCINA",0,72,0,0,{"$f":"IF('Mod05'!G109<>\"\",'Mod05'!G109,\"X\")","v":"X"},0,"","","","","","","","","","","","","","","","","","","","","","","","","","","","","","","","","","","","","","","","","","","","","","","","","","","","","","","","","","","","","","","","","","","","","","","","","","","","","","","","","","","","","","","","","","","","","","","","","","","","","","","","","","","","","","","","","","","","","","","","","","","","",""]
["072: TÓPICO",0,73,0,0,{"$f":"IF('Mod05'!G110<>\"\",'Mod05'!G110,\"X\")","v":"X"},0,"","","","","","","","","","","","","","","","","","","","","","","","","","","","","","","","","","","","","","","","","","","","","","","","","","","","","","","","","","","","","","","","","","","","","","","","","","","","","","","","","","","","","","","","","","","","","","","","","","","","","","","","","","","","","","","","","","","","","","","","","","","","",""]
["073: LACTARIO",0,74,0,0,{"$f":"IF('Mod05'!G111<>\"\",'Mod05'!G111,\"X\")","v":"X"},0,"","","","","","","","","","","","","","","","","","","","","","","","","","","","","","","","","","","","","","","","","","","","","","","","","","","","","","","","","","","","","","","","","","","","","","","","","","","","","","","","","","","","","","","","","","","","","","","","","","","","","","","","","","","","","","","","","","","","","","","","","","","","",""]
["074: ESPACIO TEMPORAL PARA DOCENTE (INICIAL, PRIMARIA O SECUNDARIA)",0,75,0,0,{"$f":"IF('Mod05'!G112<>\"\",'Mod05'!G112,\"X\")","v":"X"},0,"","","","","","","","","","","","","","","","","","","","","","","","","","","","","","","","","","","","","","","","","","","","","","","","","","","","","","","","","","","","","","","","","","","","","","","","","","","","","","","","","","","","","","","","","","","","","","","","","","","","","","","","","","","","","","","","","","","","","","","","","","","","",""]
["075: RESIDENCIA ESTUDIANTIL (SECUNDARIA)",0,76,0,0,{"$f":"IF('Mod05'!G113<>\"\",'Mod05'!G113,\"X\")","v":"X"},0,"","","","","","","","","","","","","","","","","","","","","","","","","","","","","","","","","","","","","","","","","","","","","","","","","","","","","","","","","","","","","","","","","","","","","","","","","","","","","","","","","","","","","","","","","","","","","","","","","","","","","","","","","","","","","","","","","","","","","","","","","","","","",""]
["076: ESPACIO TEMPORAL PARA EL PERSONAL DE ACOMPAÑAMIENTO EN RESIDENCIA ESTUDIANTIL (SECUNDARIA)",0,77,0,0,{"$f":"IF('Mod05'!G114<>\"\",'Mod05'!G114,\"X\")","v":"X"},0,"","","","","","","","","","","","","","","","","","","","","","","","","","","","","","","","","","","","","","","","","","","","","","","","","","","","","","","","","","","","","","","","","","","","","","","","","","","","","","","","","","","","","","","","","","","","","","","","","","","","","","","","","","","","","","","","","","","","","","","","","","","","",""]
["077: MÓDULO DE ACOMPAÑAMIENTO Y CONSEJERÍA",0,78,0,0,{"$f":"IF('Mod05'!G115<>\"\",'Mod05'!G115,\"X\")","v":"X"},0,"","","","","","","","","","","","","","","","","","","","","","","","","","","","","","","","","","","","","","","","","","","","","","","","","","","","","","","","","","","","","","","","","","","","","","","","","","","","","","","","","","","","","","","","","","","","","","","","","","","","","","","","","","","","","","","","","","","","","","","","","","","","",""]
["078: COORDINACIÓN DE TUTORÍA (JEC)",0,79,0,0,{"$f":"IF('Mod05'!G116<>\"\",'Mod05'!G116,\"X\")","v":"X"},0,"","","","","","","","","","","","","","","","","","","","","","","","","","","","","","","","","","","","","","","","","","","","","","","","","","","","","","","","","","","","","","","","","","","","","","","","","","","","","","","","","","","","","","","","","","","","","","","","","","","","","","","","","","","","","","","","","","","","","","","","","","","","",""]
["079: SALA EQUIPO SAANEE (CEBE)",0,80,0,0,{"$f":"IF('Mod05'!G117<>\"\",'Mod05'!G117,\"X\")","v":"X"},0,"","","","","","","","","","","","","","","","","","","","","","","","","","","","","","","","","","","","","","","","","","","","","","","","","","","","","","","","","","","","","","","","","","","","","","","","","","","","","","","","","","","","","","","","","","","","","","","","","","","","","","","","","","","","","","","","","","","","","","","","","","","","",""]
["080: SALA PSICOPEDAGÓGICA (CEBE)",0,81,0,0,{"$f":"IF('Mod05'!G118<>\"\",'Mod05'!G118,\"X\")","v":"X"},0,"","","","","","","","","","","","","","","","","","","","","","","","","","","","","","","","","","","","","","","","","","","","","","","","","","","","","","","","","","","","","","","","","","","","","","","","","","","","","","","","","","","","","","","","","","","","","","","","","","","","","","","","","","","","","","","","","","","","","","","","","","","","",""]
["081: OFICINA APAFA (CEBE)",0,82,0,0,{"$f":"IF('Mod05'!G119<>\"\",'Mod05'!G119,\"X\")","v":"X"},0,"","","","","","","","","","","","","","","","","","","","","","","","","","","","","","","","","","","","","","","","","","","","","","","","","","","","","","","","","","","","","","","","","","","","","","","","","","","","","","","","","","","","","","","","","","","","","","","","","","","","","","","","","","","","","","","","","","","","","","","","","","","","",""]
["082: UNIDAD DE BIENESTAR Y EMPLEABILIDAD. (ED.SUPERIOR O ETP)",0,83,0,0,{"$f":"IF('Mod05'!G120<>\"\",'Mod05'!G120,\"X\")","v":"X"},0,"","","","","","","","","","","","","","","","","","","","","","","","","","","","","","","","","","","","","","","","","","","","","","","","","","","","","","","","","","","","","","","","","","","","","","","","","","","","","","","","","","","","","","","","","","","","","","","","","","","","","","","","","","","","","","","","","","","","","","","","","","","","",""]
["083: CAPILLA, TEMPLO O SIMILAR. (ED.SUPERIOR O ETP)",0,84,0,0,{"$f":"IF('Mod05'!G121<>\"\",'Mod05'!G121,\"X\")","v":"X"},0,"","","","","","","","","","","","","","","","","","","","","","","","","","","","","","","","","","","","","","","","","","","","","","","","","","","","","","","","","","","","","","","","","","","","","","","","","","","","","","","","","","","","","","","","","","","","","","","","","","","","","","","","","","","","","","","","","","","","","","","","","","","","",""]
["084: OTRO ESPACIO PARA BIENESTAR",0,85,0,0,null,0,"","","","","","","","","","","","","","","","","","","","","","","","","","","","","","","","","","","","","","","","","","","","","","","","","","","","","","","","","","","","","","","","","","","","","","","","","","","","","","","","","","","","","","","","","","","","","","","","","","","","","","","","","","","","","","","","","","","","","","","","","","","","",""]
["085: ALMACÉN O DEPÓSITO GENERAL",0,86,0,0,null,0,"","","","","","","","","","","","","","","","","","","","","","","","","","","","","","","","","","","","","","","","","","","","","","","","","","","","","","","","","","","","","","","","","","","","","","","","","","","","","","","","","","","","","","","","","","","","","","","","","","","","","","","","","","","","","","","","","","","","","","","","","","","","",""]
["086: VIGILANCIA O CASETA DE CONTROL",0,87,0,0,null,0,"","","","","","","","","","","","","","","","","","","","","","","","","","","","","","","","","","","","","","","","","","","","","","","","","","","","","","","","","","","","","","","","","","","","","","","","","","","","","","","","","","","","","","","","","","","","","","","","","","","","","","","","","","","","","","","","","","","","","","","","","","","","",""]
["087: CUARTO DE MÁQUINAS Y CISTERNAS",0,88,0,0,null,0,"","","","","","","","","","","","","","","","","","","","","","","","","","","","","","","","","","","","","","","","","","","","","","","","","","","","","","","","","","","","","","","","","","","","","","","","","","","","","","","","","","","","","","","","","","","","","","","","","","","","","","","","","","","","","","","","","","","","","","","","","","","","",""]
["088: AMBIENTE PARA ALMACENAMIENTO DE RESIDUOS SÓLIDOS",0,89,0,0,null,0,"","","","","","","","","","","","","","","","","","","","","","","","","","","","","","","","","","","","","","","","","","","","","","","","","","","","","","","","","","","","","","","","","","","","","","","","","","","","","","","","","","","","","","","","","","","","","","","","","","","","","","","","","","","","","","","","","","","","","","","","","","","","",""]
["089: CUARTO DE LIMPIEZA",0,90,0,0,null,0,"","","","","","","","","","","","","","","","","","","","","","","","","","","","","","","","","","","","","","","","","","","","","","","","","","","","","","","","","","","","","","","","","","","","","","","","","","","","","","","","","","","","","","","","","","","","","","","","","","","","","","","","","","","","","","","","","","","","","","","","","","","","",""]
["090: CUARTO ELÉCTRICO",0,91,0,0,null,0,"","","","","","","","","","","","","","","","","","","","","","","","","","","","","","","","","","","","","","","","","","","","","","","","","","","","","","","","","","","","","","","","","","","","","","","","","","","","","","","","","","","","","","","","","","","","","","","","","","","","","","","","","","","","","","","","","","","","","","","","","","","","",""]
["091: MAESTRANZA",0,92,0,0,null,0,"","","","","","","","","","","","","","","","","","","","","","","","","","","","","","","","","","","","","","","","","","","","","","","","","","","","","","","","","","","","","","","","","","","","","","","","","","","","","","","","","","","","","","","","","","","","","","","","","","","","","","","","","","","","","","","","","","","","","","","","","","","","",""]
["092: MÓDULO DE CONECTIVIDAD",0,93,0,0,null,0,"","","","","","","","","","","","","","","","","","","","","","","","","","","","","","","","","","","","","","","","","","","","","","","","","","","","","","","","","","","","","","","","","","","","","","","","","","","","","","","","","","","","","","","","","","","","","","","","","","","","","","","","","","","","","","","","","","","","","","","","","","","","",""]
["093: DEPÓSITO DE IMPLEMENTOS DEPORTIVOS",0,94,0,0,null,0,"","","","","","","","","","","","","","","","","","","","","","","","","","","","","","","","","","","","","","","","","","","","","","","","","","","","","","","","","","","","","","","","","","","","","","","","","","","","","","","","","","","","","","","","","","","","","","","","","","","","","","","","","","","","","","","","","","","","","","","","","","","","",""]
["094: DEPÓSITO DE HERRAMIENTAS Y MATERIALES (PARA AMBIENTES TIPO G)",0,95,0,0,null,0,"","","","","","","","","","","","","","","","","","","","","","","","","","","","","","","","","","","","","","","","","","","","","","","","","","","","","","","","","","","","","","","","","","","","","","","","","","","","","","","","","","","","","","","","","","","","","","","","","","","","","","","","","","","","","","","","","","","","","","","","","","","","",""]
["095: DEPÓSITO DE PRODUCTOS (PARA AMBIENTES TIPO G)",0,96,0,0,null,0,"","","","","","","","","","","","","","","","","","","","","","","","","","","","","","","","","","","","","","","","","","","","","","","","","","","","","","","","","","","","","","","","","","","","","","","","","","","","","","","","","","","","","","","","","","","","","","","","","","","","","","","","","","","","","","","","","","","","","","","","","","","","",""]
["096: OTRO ESPACIO DE SERVICIOS GENERALES",0,97,0,0,null,0,"","","","","","","","","","","","","","","","","","","","","","","","","","","","","","","","","","","","","","","","","","","","","","","","","","","","","","","","","","","","","","","","","","","","","","","","","","","","","","","","","","","","","","","","","","","","","","","","","","","","","","","","","","","","","","","","","","","","","","","","","","","","",""]
["097: ESPACIOS PARA PERSONAL DE GESTIÓN ADMINISTRATIVA Y PEDAGÓGICA",0,98,0,0,null,0,"","","","","","","","","","","","","","","","","","","","","","","","","","","","","","","","","","","","","","","","","","","","","","","","","","","","","","","","","","","","","","","","","","","","","","","","","","","","","","","","","","","","","","","","","","","","","","","","","","","","","","","","","","","","","","","","","","","","","","","","","","","","",""]
["098: OFICINA DE COORDINACIÓN PEDAGÓGICA (ED.BÁSICA)",0,99,0,0,null,0,"","","","","","","","","","","","","","","","","","","","","","","","","","","","","","","","","","","","","","","","","","","","","","","","","","","","","","","","","","","","","","","","","","","","","","","","","","","","","","","","","","","","","","","","","","","","","","","","","","","","","","","","","","","","","","","","","","","","","","","","","","","","",""]
["099: ÁREA DE ESPERA",0,100,0,0,null,0,"","","","","","","","","","","","","","","","","","","","","","","","","","","","","","","","","","","","","","","","","","","","","","","","","","","","","","","","","","","","","","","","","","","","","","","","","","","","","","","","","","","","","","","","","","","","","","","","","","","","","","","","","","","","","","","","","","","","","","","","","","","","",""]
["100: ARCHIVO, ECONOMATO Y/O DEPÓSITO DE MATERIALES DE OFICINA",0,101,0,0,null,0,"","","","","","","","","","","","","","","","","","","","","","","","","","","","","","","","","","","","","","","","","","","","","","","","","","","","","","","","","","","","","","","","","","","","","","","","","","","","","","","","","","","","","","","","","","","","","","","","","","","","","","","","","","","","","","","","","","","","","","","","","","","","",""]
["101: SALA DE DOCENTES / SALA PARA EL PERSONAL DOCENTE",0,102,0,0,null,0,"","","","","","","","","","","","","","","","","","","","","","","","","","","","","","","","","","","","","","","","","","","","","","","","","","","","","","","","","","","","","","","","","","","","","","","","","","","","","","","","","","","","","","","","","","","","","","","","","","","","","","","","","","","","","","","","","","","","","","","","","","","","",""]
["102: SALA DE REUNIONES",0,103,0,0,null,0,"","","","","","","","","","","","","","","","","","","","","","","","","","","","","","","","","","","","","","","","","","","","","","","","","","","","","","","","","","","","","","","","","","","","","","","","","","","","","","","","","","","","","","","","","","","","","","","","","","","","","","","","","","","","","","","","","","","","","","","","","","","","",""]
["103: SALA DE PROFESIONALES (CEBE)",0,104,0,0,null,0,"","","","","","","","","","","","","","","","","","","","","","","","","","","","","","","","","","","","","","","","","","","","","","","","","","","","","","","","","","","","","","","","","","","","","","","","","","","","","","","","","","","","","","","","","","","","","","","","","","","","","","","","","","","","","","","","","","","","","","","","","","","","",""]
["104: UNIDAD ACADÉMICA (ED.SUPERIOR O ETP)",0,105,0,0,null,0,"","","","","","","","","","","","","","","","","","","","","","","","","","","","","","","","","","","","","","","","","","","","","","","","","","","","","","","","","","","","","","","","","","","","","","","","","","","","","","","","","","","","","","","","","","","","","","","","","","","","","","","","","","","","","","","","","","","","","","","","","","","","",""]
["105: COORDINACIÓN DE PROGRAMAS DE ESTUDIOS (ED.SUPERIOR O ETP)",0,106,0,0,null,0,"","","","","","","","","","","","","","","","","","","","","","","","","","","","","","","","","","","","","","","","","","","","","","","","","","","","","","","","","","","","","","","","","","","","","","","","","","","","","","","","","","","","","","","","","","","","","","","","","","","","","","","","","","","","","","","","","","","","","","","","","","","","",""]
["106: UNIDAD DE INVESTIGACIÓN (ED.SUPERIOR O ETP)",0,107,0,0,null,0,"","","","","","","","","","","","","","","","","","","","","","","","","","","","","","","","","","","","","","","","","","","","","","","","","","","","","","","","","","","","","","","","","","","","","","","","","","","","","","","","","","","","","","","","","","","","","","","","","","","","","","","","","","","","","","","","","","","","","","","","","","","","",""]
["107: UNIDAD DE FORMACIÓN CONTINUA (ED.SUPERIOR O ETP)",0,108,0,0,null,0,"","","","","","","","","","","","","","","","","","","","","","","","","","","","","","","","","","","","","","","","","","","","","","","","","","","","","","","","","","","","","","","","","","","","","","","","","","","","","","","","","","","","","","","","","","","","","","","","","","","","","","","","","","","","","","","","","","","","","","","","","","","","",""]
["108: ÁREA DE CALIDAD (ED.SUPERIOR O ETP)",0,109,0,0,null,0,"","","","","","","","","","","","","","","","","","","","","","","","","","","","","","","","","","","","","","","","","","","","","","","","","","","","","","","","","","","","","","","","","","","","","","","","","","","","","","","","","","","","","","","","","","","","","","","","","","","","","","","","","","","","","","","","","","","","","","","","","","","","",""]
["109: SECRETARÍA ACADÉMICA (ED.SUPERIOR O ETP) ",0,110,0,0,null,0,"","","","","","","","","","","","","","","","","","","","","","","","","","","","","","","","","","","","","","","","","","","","","","","","","","","","","","","","","","","","","","","","","","","","","","","","","","","","","","","","","","","","","","","","","","","","","","","","","","","","","","","","","","","","","","","","","","","","","","","","","","","","",""]
["110: OTRO ESPACIO DE GESTIÓN ADMINISTRATIVA Y PEDAGÓGICA",0,111,0,0,null,0,"","","","","","","","","","","","","","","","","","","","","","","","","","","","","","","","","","","","","","","","","","","","","","","","","","","","","","","","","","","","","","","","","","","","","","","","","","","","","","","","","","","","","","","","","","","","","","","","","","","","","","","","","","","","","","","","","","","","","","","","","","","","",""]
[null,0,112,0,0,null,0,"","","","","","","","","","","","","","","","","","","","","","","","","","","","","","","","","","","","","","","","","","","","","","","","","","","","","","","","","","","","","","","","","","","","","","","","","","","","","","","","","","","","","","","","","","","","","","","","","","","","","","","","","","","","","","","","","","","","","","","","","","","","",""]
[null,0,113,0,0,null,0,"","","","","","","","","","","","","","","","","","","","","","","","","","","","","","","","","","","","","","","","","","","","","","","","","","","","","","","","","","","","","","","","","","","","","","","","","","","","","","","","","","","","","","","","","","","","","","","","","","","","","","","","","","","","","","","","","","","","","","","","","","","","",""]
[null,0,114,0,0,null,0,"","","","","","","","","","","","","","","","","","","","","","","","","","","","","","","","","","","","","","","","","","","","","","","","","","","","","","","","","","","","","","","","","","","","","","","","","","","","","","","","","","","","","","","","","","","","","","","","","","","","","","","","","","","","","","","","","","","","","","","","","","","","",""]
[null,0,115,0,0,null,0,"","","","","","","","","","","","","","","","","","","","","","","","","","","","","","","","","","","","","","","","","","","","","","","","","","","","","","","","","","","","","","","","","","","","","","","","","","","","","","","","","","","","","","","","","","","","","","","","","","","","","","","","","","","","","","","","","","","","","","","","","","","","",""]
[null,0,116,0,0,null,0,"","","","","","","","","","","","","","","","","","","","","","","","","","","","","","","","","","","","","","","","","","","","","","","","","","","","","","","","","","","","","","","","","","","","","","","","","","","","","","","","","","","","","","","","","","","","","","","","","","","","","","","","","","","","","","","","","","","","","","","","","","","","",""]
[null,0,117,0,0,null,0,"","","","","","","","","","","","","","","","","","","","","","","","","","","","","","","","","","","","","","","","","","","","","","","","","","","","","","","","","","","","","","","","","","","","","","","","","","","","","","","","","","","","","","","","","","","","","","","","","","","","","","","","","","","","","","","","","","","","","","","","","","","","",""]
[null,0,118,0,0,null,0,"","","","","","","","","","","","","","","","","","","","","","","","","","","","","","","","","","","","","","","","","","","","","","","","","","","","","","","","","","","","","","","","","","","","","","","","","","","","","","","","","","","","","","","","","","","","","","","","","","","","","","","","","","","","","","","","","","","","","","","","","","","","",""]
[null,0,119,0,0,null,0,"","","","","","","","","","","","","","","","","","","","","","","","","","","","","","","","","","","","","","","","","","","","","","","","","","","","","","","","","","","","","","","","","","","","","","","","","","","","","","","","","","","","","","","","","","","","","","","","","","","","","","","","","","","","","","","","","","","","","","","","","","","","",""]
[null,0,120,0,0,null,0,"","","","","","","","","","","","","","","","","","","","","","","","","","","","","","","","","","","","","","","","","","","","","","","","","","","","","","","","","","","","","","","","","","","","","","","","","","","","","","","","","","","","","","","","","","","","","","","","","","","","","","","","","","","","","","","","","","","","","","","","","","","","",""]
[null,0,121,0,0,null,0,"","","","","","","","","","","","","","","","","","","","","","","","","","","","","","","","","","","","","","","","","","","","","","","","","","","","","","","","","","","","","","","","","","","","","","","","","","","","","","","","","","","","","","","","","","","","","","","","","","","","","","","","","","","","","","","","","","","","","","","","","","","","",""]
[null,0,122,0,0,null,0,"","","","","","","","","","","","","","","","","","","","","","","","","","","","","","","","","","","","","","","","","","","","","","","","","","","","","","","","","","","","","","","","","","","","","","","","","","","","","","","","","","","","","","","","","","","","","","","","","","","","","","","","","","","","","","","","","","","","","","","","","","","","",""]
[null,0,123,0,0,null,0,"","","","","","","","","","","","","","","","","","","","","","","","","","","","","","","","","","","","","","","","","","","","","","","","","","","","","","","","","","","","","","","","","","","","","","","","","","","","","","","","","","","","","","","","","","","","","","","","","","","","","","","","","","","","","","","","","","","","","","","","","","","","",""]
[null,0,124,0,0,null,0,"","","","","","","","","","","","","","","","","","","","","","","","","","","","","","","","","","","","","","","","","","","","","","","","","","","","","","","","","","","","","","","","","","","","","","","","","","","","","","","","","","","","","","","","","","","","","","","","","","","","","","","","","","","","","","","","","","","","","","","","","","","","",""]
["Tabla : Si, No",0,125,0,0,null,0,"","","","","","","","","","","","","","","","","","","","","","","","","","","","","","","","","","","","","","","","","","","","","","","","","","","","","","","","","","","","","","","","","","","","","","","","","","","","","","","","","","","","","","","","","","","","","","","","","","","","","","","","","","","","","","","","","","","","","","","","","","","","",""]
["01: Const. para tal fin",0,126,0,0,null,0,"","","","","","","","","","","","","","","","","","","","","","","","","","","","","","","","","","","","","","","","","","","","","","","","","","","","","","","","","","","","","","","","","","","","","","","","","","","","","","","","","","","","","","","","","","","","","","","","","","","","","","","","","","","","","","","","","","","","","","","","","","","","",""]
["02: Adaptado",0,127,0,0,null,0,"","","","","","","","","","","","","","","","","","","","","","","","","","","","","","","","","","","","","","","","","","","","","","","","","","","","","","","","","","","","","","","","","","","","","","","","","","","","","","","","","","","","","","","","","","","","","","","","","","","","","","","","","","","","","","","","","","","","","","","","","","","","",""]
[null,0,128,0,0,null,0,"","","","","","","","","","","","","","","","","","","","","","","","","","","","","","","","","","","","","","","","","","","","","","","","","","","","","","","","","","","","","","","","","","","","","","","","","","","","","","","","","","","","","","","","","","","","","","","","","","","","","","","","","","","","","","","","","","","","","","","","","","","","",""]
["Tabla : Si, No",0,129,0,0,null,0,"","","","","","","","","","","","","","","","","","","","","","","","","","","","","","","","","","","","","","","","","","","","","","","","","","","","","","","","","","","","","","","","","","","","","","","","","","","","","","","","","","","","","","","","","","","","","","","","","","","","","","","","","","","","","","","","","","","","","","","","","","","","",""]
["SI",{"$f":"IF(OR(LEFT(K146,3)=\"063\",LEFT(K146,3)=\"064\",LEFT(K146,3)=\"065\",LEFT(K146,3)=\"066\",LEFT(K146,3)=\"067\"),1,0)","v":0},130,{"$f":"IF(OR(LEFT(K146,3)=\"011\",LEFT(K146,3)=\"012\",LEFT(K146,3)=\"013\",LEFT(K146,3)=\"014\"),1,0)","v":0},{"$f":"IF(OR(LEFT(K146,3)=\"020\",LEFT(K146,3)=\"029\",LEFT(K146,3)=\"030\",LEFT(K146,3)=\"031\",LEFT(K146,3)=\"032\",LEFT(K146,3)=\"033\"),1,0)","v":0},null,0,"","","","","","","","","","","","","","","","","","","","","","","","","","","","","","","","","","","","","","","","","","","","","","","","","","","","","","","","","","","","","","","","","","","","","","","","","","","","","","","","","","","","","","","","","","","","","","","","","","","","","","","","","","","","","","","","","","","","","","","","","","","","",""]
["NO",0,131,0,0,null,{"$f":"IF(OR(LEFT(K147,3)=\"024\",LEFT(K147,3)=\"025\"),1,0)","v":0},{"$f":"IF($C147<=$M$10,C147,\"\")","v":""},"","","","","","","","","","","","","","","","","","","","","","","","","","","","","","","","","","","","","","","","","","","","","","","","","","","","","","","","","","","","","","","","","","","","","","","","","","","","","","","","","","","","","","","","","","","","","","","","","","","","","","","","","","","","","","","","","","","","","","","","","","","",""]
["NA",0,132,0,0,null,0,"","","","","","","","","","","","","","","","","","","","","","","","","","","","","","","","","","","","","","","","","","","","","","","","","","","","","","","","","","","","","","","","","","","","","","","","","","","","","","","","","","","","","","","","","","","","","","","","","","","","","","","","","","","","","","","","","","","","","","","","","","","","",""]
["TABLA 02 - Puertas",0,133,0,0,null,0,"","","","","","","","","","","","","","","","","","","","","","","","","","","","","","","","","","","","","","","","","","","","","","","","","","","","","","","","","","","","","","","","","","","","","","","","","","","","","","","","","","","","","","","","","","","","","","","","","","","","","","","","","","","","","","","","","","","","","","","","","","","","",""]
["01: Madera",0,134,0,0,null,0,"","","","","","","","","","","","","","","","","","","","","","","","","","","","","","","","","","","","","","","","","","","","","","","","","","","","","","","","","","","","","","","","","","","","","","","","","","","","","","","","","","","","","","","","","","","","","","","","","","","","","","","","","","","","","","","","","","","","","","","","","","","","",""]
["02: Mallas metálicas",0,135,0,0,null,0,"","","","","","","","","","","","","","","","","","","","","","","","","","","","","","","","","","","","","","","","","","","","","","","","","","","","","","","","","","","","","","","","","","","","","","","","","","","","","","","","","","","","","","","","","","","","","","","","","","","","","","","","","","","","","","","","","","","","","","","","","","","","",""]
["03: Rejas metálicas",0,136,0,0,null,0,"","","","","","","","","","","","","","","","","","","","","","","","","","","","","","","","","","","","","","","","","","","","","","","","","","","","","","","","","","","","","","","","","","","","","","","","","","","","","","","","","","","","","","","","","","","","","","","","","","","","","","","","","","","","","","","","","","","","","","","","","","","","",""]
["04: Planchas metálicas",0,137,0,0,null,0,"","","","","","","","","","","","","","","","","","","","","","","","","","","","","","","","","","","","","","","","","","","","","","","","","","","","","","","","","","","","","","","","","","","","","","","","","","","","","","","","","","","","","","","","","","","","","","","","","","","","","","","","","","","","","","","","","","","","","","","","","","","","",""]
["05: Drywall",0,138,0,0,null,0,"","","","","","","","","","","","","","","","","","","","","","","","","","","","","","","","","","","","","","","","","","","","","","","","","","","","","","","","","","","","","","","","","","","","","","","","","","","","","","","","","","","","","","","","","","","","","","","","","","","","","","","","","","","","","","","","","","","","","","","","","","","","",""]
["06: Vidrio",0,139,0,0,null,0,"","","","","","","","","","","","","","","","","","","","","","","","","","","","","","","","","","","","","","","","","","","","","","","","","","","","","","","","","","","","","","","","","","","","","","","","","","","","","","","","","","","","","","","","","","","","","","","","","","","","","","","","","","","","","","","","","","","","","","","","","","","","",""]
["07: Otro",0,140,0,0,null,0,"","","","","","","","","","","","","","","","","","","","","","","","","","","","","","","","","","","","","","","","","","","","","","","","","","","","","","","","","","","","","","","","","","","","","","","","","","","","","","","","","","","","","","","","","","","","","","","","","","","","","","","","","","","","","","","","","","","","","","","","","","","","",""]
["08: NT. Lo requiere",0,141,0,0,null,0,"","","","","","","","","","","","","","","","","","","","","","","","","","","","","","","","","","","","","","","","","","","","","","","","","","","","","","","","","","","","","","","","","","","","","","","","","","","","","","","","","","","","","","","","","","","","","","","","","","","","","","","","","","","","","","","","","","","","","","","","","","","","",""]
["09: NT. No lo requiere",0,142,0,0,null,0,"","","","","","","","","","","","","","","","","","","","","","","","","","","","","","","","","","","","","","","","","","","","","","","","","","","","","","","","","","","","","","","","","","","","","","","","","","","","","","","","","","","","","","","","","","","","","","","","","","","","","","","","","","","","","","","","","","","","","","","","","","","","",""]
[null,0,143,0,0,null,0,"","","","","","","","","","","","","","","","","","","","","","","","","","","","","","","","","","","","","","","","","","","","","","","","","","","","","","","","","","","","","","","","","","","","","","","","","","","","","","","","","","","","","","","","","","","","","","","","","","","","","","","","","","","","","","","","","","","","","","","","","","","","",""]
["TABLA 03 - Ventanas",0,144,0,0,null,0,"","","","","","","","","","","","","","","","","","","","","","","","","","","","","","","","","","","","","","","","","","","","","","","","","","","","","","","","","","","","","","","","","","","","","","","","","","","","","","","","","","","","","","","","","","","","","","","","","","","","","","","","","","","","","","","","","","","","","","","","","","","","",""]
["01: Carp. metálica",0,145,0,0,null,0,"","","","","","","","","","","","","","","","","","","","","","","","","","","","","","","","","","","","","","","","","","","","","","","","","","","","","","","","","","","","","","","","","","","","","","","","","","","","","","","","","","","","","","","","","","","","","","","","","","","","","","","","","","","","","","","","","","","","","","","","","","","","",""]
["02: Carp. de madera",0,146,0,0,null,0,"","","","","","","","","","","","","","","","","","","","","","","","","","","","","","","","","","","","","","","","","","","","","","","","","","","","","","","","","","","","","","","","","","","","","","","","","","","","","","","","","","","","","","","","","","","","","","","","","","","","","","","","","","","","","","","","","","","","","","","","","","","","",""]
["03: Carp. de PVC",0,147,0,0,null,0,"","","","","","","","","","","","","","","","","","","","","","","","","","","","","","","","","","","","","","","","","","","","","","","","","","","","","","","","","","","","","","","","","","","","","","","","","","","","","","","","","","","","","","","","","","","","","","","","","","","","","","","","","","","","","","","","","","","","","","","","","","","","",""]
["04: Carp. mixta",0,148,0,0,null,0,"","","","","","","","","","","","","","","","","","","","","","","","","","","","","","","","","","","","","","","","","","","","","","","","","","","","","","","","","","","","","","","","","","","","","","","","","","","","","","","","","","","","","","","","","","","","","","","","","","","","","","","","","","","","","","","","","","","","","","","","","","","","",""]
["05: Otro",0,149,0,0,null,0,"","","","","","","","","","","","","","","","","","","","","","","","","","","","","","","","","","","","","","","","","","","","","","","","","","","","","","","","","","","","","","","","","","","","","","","","","","","","","","","","","","","","","","","","","","","","","","","","","","","","","","","","","","","","","","","","","","","","","","","","","","","","",""]
["06: NT. Lo requiere",0,150,0,0,null,0,{"$f":"IF($C166<=$M$10,C166,\"\")","v":""},"","","","","","","","","","","","","","","","","","","","","","","","","","","","","","","","","","","","","","","","","","","","","","","","","","","","","","","","","","","","","","","","","","","","","","","","","","","","","","","","","","","","","","","","","","","","","","","","","","","","","","","","","","","","","","","","","","","","","","","","","","","",""]
["07: NT. No lo requiere",null,151]
[null,null,152,null,null,null,null,"…","…","…","…","…","…","…","…","…","…","…","…","…","…","…","…","…","…","…","…","…","…","…","…","…","…","…","…","…","…","…","…","…","…","…"]
[null,null,153]
["TABLA 04 - Estado",null,154]
["01: Bueno",null,155]
["02: Regular",null,156]
["03: Mal estado",null,157]
["04: No aplica",null,158]
[null,null,159]
[null,null,160]
["TABLA 05 - Paredes",null,161]
["01: Ladrillo o concreto",null,162]
["02: Adobe o tapial",null,163]
["03: Quincha",null,164]
["04: Piedra con barro cal o cemento",null,165]
["05: Madera",null,166]
["06: Triplay",null,167]
["07: Eternit o fibra de concreto",null,168]
["08: Estera, cartón o plástico",null,169]
["09: Otro",null,170]
[null,null,171]
[null,null,172]
[null,null,173]
["TABLA 06 - Techo",null,174]
["01: Concreto armado",null,175]
["02: Madera",null,176]
["03: Teja",null,177]
["04: Fibra de cemento",null,178]
["05: Calamina",null,179]
["06: Calaminon",null,180]
["07: Eternit",null,181]
["08: Caña con barro",null,182]
["09: Lata o latón",null,183]
["10: Otro",null,184]
[null,null,185]
[null,null,186]
[null,null,187]
["TABLA 07 - Piso",null,188]
["01: Parquet o madera pulida",null,189]
["02: Vinilico, pisopak o similar",null,190]
["03: Loseta, cerámico o similar",null,191]
["04: Cemento",null,192]
["05: Madera entablado",null,193]
["06: Tierra",null,194]
["07: Otro",null,195]
[null,null,196]
[null,null,197]
[null,null,198]
[null,null,199]
[null,null,200]

{"sheet":"Mod77","index":8,"n_rows":91,"n_cols":39,"rows_kept":91,"cut":false,"hidden":false,"merged":[[81,14,81,17],[44,11,44,12],[45,11,45,12],[46,11,46,12],[47,11,47,12],[48,11,48,12],[50,11,50,12],[51,11,51,12],[52,11,52,12],[53,11,53,12],[54,11,54,12],[55,11,55,12],[66,11,66,12],[64,11,64,12],[65,11,65,12],[59,11,59,12],[2,12,2,28],[1,12,1,28],[36,11,36,12],[37,11,37,12],[38,11,38,12],[33,13,35,13],[33,15,33,28],[33,29,33,30],[32,29,32,30],[33,14,35,14],[32,15,32,28],[24,14,24,17],[60,11,60,12],[61,11,61,12],[62,11,62,12],[63,11,63,12],[34,29,35,29],[39,11,39,12],[40,11,40,12],[56,11,56,12],[57,11,57,12],[58,11,58,12],[41,11,41,12],[42,11,42,12],[43,11,43,12],[49,11,49,12]]}
[]
[null,null,null,null,null,null,null,null,null,null,null,null,"CENSO EDUCATIVO 2026"]
[null,null,null,null,null,null,null,null,null,null,null,null,"LOCAL EDUCATIVO"]
[]
[]
[]
[null,null,null,null,null,null,null,null,null,null,"SOLO PARA EDUCACIÓN SECUNDARIA DE LA EDUCACIÓN BÁSICA REGULAR"]
[null,null,null,null,null,null,null,null,null,null,"SI REPORTÓ CONTAR CON AL MENOS UN AMBIENTE DE TALLER PARA EDUCACIÓN PARA EL TRABAJO (EPT),",null,null,null,null,null,null,null,null,null,"SI REPORTÓ CONTAR CON AL MENOS UN AMBIENTE DESTINADO PARA LABORATORIO DE CIENCIAS"]
[null,null,null,null,null,null,null,null,null,null,"CÓDIGOS 024 Y 025 DE TABLA 01 DE PÁGINA 15, RESPONDA:",null,null,null,null,null,null,null,null,null,"(CÓDIGOS 020, 029, 030, 031, 032 Y 033 DE TABLA 01 DE PÁGINA 15), RESPONDA:"]
[null,null,null,null,null,null,null,null,null,null,{"$f":"IF('Mod07'!G16>0,\"X\",\"\")","v":""},"7.2. ¿SU INVENTARIO SE ENCUENTRA REGISTRADO EN LA UGEL?",null,null,null,null,null,null,null,{"$f":"IF('Mod07'!E16>0,\"X\",\"\")","v":""}]
[null,null,null,null,null,null,null,null,null,null,null,null,null,null,null,null,null,null,null,null,"7.4. ¿EL LABORATORIO DE CIENCIAS ES DE QUÍMICA?"]
[null,null,null,null,null,null,null,null,null,null,null,null,null,"Sí"]
[]
[null,null,null,null,null,null,null,null,null,null,null,null,"","No",null,null,null,null,null,null,null,null,"","Sí",null,null,null,null,"","No"]
[]
[]
[null,null,null,null,null,null,null,null,null,null,"SI REPORTÓ CONTAR CON AL MENOS UN AMBIENTE DESTINADO PARA BIBLIOTECA (CÓDIGOS 011, 012, 013 Y 014 DE"]
[null,null,null,null,null,null,null,null,null,null,"TABLA 01 DE PÁGINA 15), Y QUE NO SE ENCUENTRA EN USO (SEGÚN LO REGISTRADO EN PÁGINA 13), RESPONDA:"]
[null,null,null,null,null,null,null,null,null,null,{"$f":"IF('Mod07'!D16>0,\"X\",\"\")","v":""},"7.3. ¿CUÁL ES EL MOTIVO PRINCIPAL POR EL CUAL LA BIBLIOTECA NO ESTA FUNCIONANDO?",null,null,null,null,null,null,null,null,"7.5. EL LOCAL EDUCATIVO CUENTA CON LABORATORIOS"]
[null,null,null,null,null,null,null,null,null,null,null,"Marque con una “X”solo una opción",null,null,null,null,null,null,null,null,null," QUE UTILICEN SOLO INSUMOS QUÍMICOS?"]
[null,null,null,null,null,null,null,null,null,null,null,null,"","Por estar en reparación y/o mantenimiento"]
[null,null,null,null,null,null,null,null,null,null,null,null,"","Por falta de libros y/o mobiliario"]
[null,null,null,null,null,null,null,null,null,null,null,null,"","Por falta de personal",null,null,null,null,null,null,null,null,"","Sí",null,null,null,null,"","No"]
[null,null,null,null,null,null,null,null,null,null,null,null,"","En proyecto"]
[null,null,null,null,null,null,null,null,null,null,null,null,null,"Otro"]
[]
[]
[null,null,null,null,null,null,null,null,null,null,"7.6. RESPECTO A LOS ESPACIOS DEPORTIVOS ABIERTOS Y ESPACIOS EXTERIORES/DE RELACIÓN CON LA NATURALEZA"]
[]
[null,null,null,null,null,null,null,null,null,null,"CANTIDAD DE ESPACIOS DEPORTIVOS ABIERTOS Y ESPACIOS EXTERIORES"]
[]
[]
[null,null,null,null,null,null,null,null,null,null,null,"(1)",null,"(2)","(3)","(4)",null,null,null,null,null,null,null,null,null,null,null,null,null,"(5)"]
[null,null,null,null,null,null,null,null,null,null,null,"Detalle del espacio",null,"El espacio ¿se encuentra en uso?","Estado de conservación","Niveles educativos que usan el espacio",null,null,null,null,null,null,null,null,null,null,null,null,null,"Protección contra la radiación solar"]
[null,null,null,null,null,null,null,null,null,"Nº",null,null,null,null,null,"P","Q","R","S","T","U","V","W","X","Y","Z","AA","AB","AC","(1)\n¿El espacio cuenta con una cubierta que protege contra la radiación solar?","Sólo si tiene cubierta, indique:"]
["Detalle del espacio","Dpx","Corr","NivB","NivS","Carr","Sup",null,null,null,"Código","Detalle",null,null,null,"A0","B0","F0","D1","D2","E0","E1","E2","L0","K0","T0","M0","P0","S0",null,"(2)\nAlcance de la cubierta:"]
["111: LOSA MULTIUSO TIPO I 15 x 28 (3 DEPORTES/NO PATIOS)",{"$f":"IF($K37<>\"\",COUNTIF($K$37:$K$67,$K37),0)","v":0},1,null,null,null,null,null,null,{"$f":"IF($C37<=$O$30,C37,\"\")","v":""},{"$f":"IF(L37<>\"\",LEFT(L37,3),\"\")","v":""},"",null,"","","","","","","","","","","","","","","","","","","","","","","","","",""]
["112: LOSA MULTIUSO TIPO II 20 x 40 (5 DEPORTES/NO PATIOS)",{"$f":"IF($K38<>\"\",COUNTIF($K$37:$K$67,$K38),0)","v":0},2,null,null,null,null,null,null,"",{"$f":"IF(L38<>\"\",LEFT(L38,3),\"\")","v":""},"",null,"","","","","","","","","","","","","","","","","","","","","","","","","",""]
["113: PISTA DE VELOCIDAD Y SALTOS (80 A 120 METROS LINEALES)",{"$f":"IF($K39<>\"\",COUNTIF($K$37:$K$67,$K39),0)","v":0},3,null,null,null,null,null,null,"",{"$f":"IF(L39<>\"\",LEFT(L39,3),\"\")","v":""},"",null,"","","","","","","","","","","","","","","","","","","","","","","","","",""]
["114: PISCINA SEMIOLÍMPICA (ED. BÁSICA)",0,4,null,null,null,null,null,null,"","","",null,"","","","","","","","","","","","","","","","","","","","","","","","","",""]
["115: PISCINA OLÍMPICA SIN TECHAR (ED. BÁSICA)",0,5,null,null,null,null,null,null,"","","",null,"","","","","","","","","","","","","","","","","","","","","","","","","",""]
["116: CAMPO DE FÚTBOL Y CAMPO ATLÉTICO (ED. BÁSICA)",0,6,null,null,null,null,null,null,"","","",null,"","","","","","","","","","","","","","","","","","","","","","","","","",""]
["117: SOLO CAMPO DE FÚTBOL (ED. BÁSICA)",0,7,null,null,null,null,null,null,"","","",null,"","","","","","","","","","","","","","","","","","","","","","","","","",""]
["118: SOLO CAMPO ATLÉTICO (ED. BÁSICA)",0,8,null,null,null,null,null,null,"","","",null,"","","","","","","","","","","","","","","","","","","","","","","","","",""]
["119: OTRO ESPACIO DEPORTIVO ABIERTO",0,9,null,null,null,null,null,null,"","","",null,"","","","","","","","","","","","","","","","","","","","","","","","","",""]
["120: ÁREA DE INGRESO ",0,10,null,null,null,null,null,null,"","","",null,"","","","","","","","","","","","","","","","","","","","","","","","","",""]
["121: PASADIZOS Y CIRCULACIONES",0,11,null,null,null,null,null,null,"","","",null,"","","","","","","","","","","","","","","","","","","","","","","","","",""]
["122: PATIO",0,12,null,null,null,null,null,null,"","","",null,"","","","","","","","","","","","","","","","","","","","","","","","","",""]
["123: ÁREA DE RECREACIÓN (PRITE Y CEBE)",0,13,null,null,null,null,null,null,"","","",null,"","","","","","","","","","","","","","","","","","","","","","","","","",""]
["124: ÁREAS VERDES Y JARDÍNES (ED. BÁSICA)",0,14,null,null,null,null,null,null,"","","",null,"","","","","","","","","","","","","","","","","","","","","","","","","",""]
["125: ESPACIO DE CULTIVO (EBR O ED. SUPERIOR O ETP)",0,15,null,null,null,null,null,null,"","","",null,"","","","","","","","","","","","","","","","","","","","","","","","","",""]
["126: ESPACIO DE CRIANZA DE ANIMALES",0,16,null,null,null,null,null,null,"","","",null,"","","","","","","","","","","","","","","","","","","","","","","","","",""]
["127: TRIBUNA / GRADERÍA",0,17,null,null,null,null,null,null,"","","",null,"","","","","","","","","","","","","","","","","","","","","","","","","",""]
["128: OTRO ESPACIO EXTERIOR Y DE RELACIÓN CON LA NATURALEZA",0,18,null,null,null,null,null,null,"","","",null,"","","","","","","","","","","","","","","","","","","","","","","","","",""]
[null,0,19,null,null,null,null,null,null,"","","",null,"","","","","","","","","","","","","","","","","","","","","","","","","",""]
["Tabla : Si, No",0,20,null,null,null,null,null,null,"","","",null,"","","","","","","","","","","","","","","","","","","","","","","","","",""]
["SI",0,21,null,null,null,null,null,null,"","","",null,"","","","","","","","","","","","","","","","","","","","","","","","","",""]
["NO",0,22,null,null,null,null,null,null,"","","",null,"","","","","","","","","","","","","","","","","","","","","","","","","",""]
[null,0,23,null,null,null,null,null,null,"","","",null,"","","","","","","","","","","","","","","","","","","","","","","","","",""]
["TABLA 05 - Estado",0,24,null,null,null,null,null,null,"","","",null,"","","","","","","","","","","","","","","","","","","","","","","","","",""]
["01: Bueno",0,25,null,null,null,null,null,null,"","","",null,"","","","","","","","","","","","","","","","","","","","","","","","","",""]
["02: Regular",0,26,null,null,null,null,null,null,"","","",null,"","","","","","","","","","","","","","","","","","","","","","","","","",""]
["03: Malo",0,27,null,null,null,null,null,null,"","","",null,"","","","","","","","","","","","","","","","","","","","","","","","","",""]
["04: Lo requiere",0,28,null,null,null,null,null,null,"","","",null,"","","","","","","","","","","","","","","","","","","","","","","","","",""]
["04: No requiere",0,29,null,null,null,null,null,null,"","","",null,"","","","","","","","","","","","","","","","","","","","","","","","","",""]
[null,0,30,null,null,null,null,null,null,"","","",null,"","","","","","","","","","","","","","","","","","","","","","","","","",""]
[null,null,31,null,null,null,null,null,null,"","","",null,"","","","","","","","","","","","","","","","","","","","","","","","","",""]
[]
["MATERIAL:",{"$f":"SUM(B37:B67)","v":0},null,null,null,null,null,null,null,null,"SI REPORTÓ CONTAR CON AL MENOS UN ESPACIO DEPORTIVO TIPO E (YA SEA CERRADO O ABIERTO), ATIENDA LAS SIGUIENTES PREGUNTAS:"]
["01: Mallas raschel",null,null,null,null,null,null,null,null,{"$f":"'Mod07'!B16","v":0},{"$f":"IF('Mod07'!B16>0,\"X\",\"\")","v":""},"7.7. ALGUNO DE LOS ESPACIOS DEPORTIVOS, ¿SE ENCUENTRAN EN CONCESIÓN?",null,null,null,null,null,null,null,null,"7.9. ¿CUENTA CON VESTIDORES UBICADOS A MENOS DE 50"]
["02: Techo de calamina",null,null,null,null,null,null,null,null,{"$f":"B69","v":0},null,null,null,null,null,null,null,null,null,null,null,"METROS DE DISTANCIA DE LAS LOSAS DEPORTIVAS?"]
["03: Otro",null,null,null,null,null,null,null,null,{"$f":"IF((J70+J71)>0,\"X\",\"\")","v":""}]
[null,null,null,null,null,null,null,null,null,null,null,null,"","Sí",null,null,null,null,null,null,null,null,null,"Sí",null,null,null,null,null,"No        }}   Pase a capítulo 8"]
["ALCANCE"]
["01: Total",null,null,null,null,null,null,null,null,null,null,null,"","No"]
["02: Parcial"]
[]
["ALCANCE",null,null,null,null,null,null,null,null,null,null,"7.8. ALGUNO DE LOS ESPACIOS DEPORTIVOS, ¿SE ENCUENTRA OCUPADO POR ALGUNA",null,null,null,null,null,null,null,null,"7.10. ¿LOS VESTIDORES CUENTAN CON DUCHAS?"]
["01: SI",null,null,null,null,null,null,null,null,null,null," INFRAESTRUCTURA PORTÁTIL, U OTRO?"]
["02: NO",null,null,null,null,null,null,null,null,null,null,null,null,null,null,null,null,null,null,null,null,null,null,"Sí",null,null,null,null,null,"No"]
["03: No aplica"]
[null,null,null,null,null,null,null,null,null,null,null,null,"","Sí          }}"]
[null,null,null,null,null,null,null,null,null,null,null,null,null,null,null,null,null,null,null,null,null,null,null,null,"Cantidad de duchas"]
[null,null,null,null,null,null,null,null,null,null,null,null,"","No"]
[]
[]
[]
["Tabla : Si, No, No aplica"]
["01: SI"]
["02: NO"]
["03: No Aplica"]

{"sheet":"Mod08","index":9,"n_rows":104,"n_cols":59,"rows_kept":104,"cut":false,"hidden":false,"merged":[[13,30,14,30],[13,40,15,40],[13,39,15,39],[12,11,13,24],[1,10,1,25],[2,10,2,25],[12,26,12,29],[13,33,13,34],[13,35,13,36],[14,31,15,31],[14,32,15,32],[14,33,15,33],[14,34,15,34],[14,35,15,35],[14,36,15,36],[14,8,15,8],[13,26,15,26],[13,9,15,9],[12,42,12,43],[13,42,14,42],[13,43,14,43],[13,41,15,41],[12,39,12,41],[13,29,15,29],[12,31,12,32],[12,33,12,34],[12,35,12,36],[13,31,13,32],[13,27,15,27],[13,28,15,28],[13,25,15,25],[12,58,15,58],[14,52,14,53],[14,55,14,56],[13,52,13,54],[13,55,13,57],[12,52,12,57],[14,54,15,54],[14,57,15,57],[13,44,15,44],[12,48,12,51],[12,37,12,38],[13,37,13,38],[13,48,13,49],[13,50,13,51],[14,48,14,49],[14,50,14,51],[13,45,13,46],[13,47,15,47],[12,44,12,47]]}
[null,null,null,null,null,{"$f":"IF('Mod05'!G22<>\"\",'Mod05'!G22,\"X\")","v":"X"}]
[null,null,null,null,null,{"$f":"IF('Mod05'!G23<>\"\",'Mod05'!G23,\"X\")","v":"X"},null,null,null,null,"CENSO EDUCATIVO 2026"]
[null,null,null,null,null,{"$f":"IF('Mod05'!G24<>\"\",'Mod05'!G24,\"X\")","v":"X"},null,null,null,null,"LOCAL EDUCATIVO"]
[null,null,null,null,null,{"$f":"IF('Mod05'!G25<>\"\",'Mod05'!G25,\"X\")","v":"X"}]
[null,null,null,null,null,{"$f":"IF('Mod05'!G26<>\"\",'Mod05'!G26,\"X\")","v":"X"}]
[null,null,null,null,null,{"$f":"IF('Mod05'!G27<>\"\",'Mod05'!G27,\"X\")","v":"X"}]
[null,null,null,null,null,{"$f":"IF('Mod05'!G28<>\"\",'Mod05'!G28,\"X\")","v":"X"},null,"CAPÍTULO 8: CARACTERÍSTICAS DE AMBIENTES USADOS COMO SERVICIOS HIGIÉNICOS EN EL LOCAL EDUCATIVO"]
[null,null,null,null,null,{"$f":"IF('Mod05'!G29<>\"\",'Mod05'!G29,\"X\")","v":"X"}]
[null,null,null,null,null,{"$f":"IF('Mod05'!G30<>\"\",'Mod05'!G30,\"X\")","v":"X"}]
[null,null,null,null,null,{"$f":"IF('Mod05'!G31<>\"\",'Mod05'!G31,\"X\")","v":"X"},null,null,null,null,"8.1. CANTIDAD DE ESPACIOS USADOS COMO SERVICIOS HIGIÉNICOS"]
[null,null,null,null,null,{"$f":"IF('Mod05'!G32<>\"\",'Mod05'!G32,\"X\")","v":"X"}]
[null,null,null,null,null,{"$f":"IF('Mod05'!G33<>\"\",'Mod05'!G33,\"X\")","v":"X"},null,8]
[null,null,null,null,null,{"$f":"IF('Mod05'!G34<>\"\",'Mod05'!G34,\"X\")","v":"X"},null,null,"(1)","(2)","(3)","(4)\n\nNiveles educativos que usan el ambiente\nMarque con una “X”",null,null,null,null,null,null,null,null,null,null,null,null,null,"(5)","(6)\nCaracterísticas de los servicios higiénicos para una persona\ncon silla de ruedas",null,null,null,"(7)","(8)",null,"(9)",null,"(10)",null,"(11)\nSobre las letrinas en los SS.HH.",null,"(12)\nCubículos",null,null,"(13)\nPuertas",null,"(14)\nSobre los inodoros y/o water en los SSHH",null,null,null,"(15)\nSobre los lavatorios o lavamanos en los SSHH",null,null,null,"(16)\nSobre los urinarios en los SSHH",null,null,null,null,null,"(17)\n\nEl ambiente del SSHH o vestidor, ¿Se encuentra habilitado con duchas operativas?"]
[null,null,null,null,null,{"$f":"IF('Mod05'!G35<>\"\",'Mod05'!G35,\"X\")","v":"X"},null,null,null,"Nº del del piso donde se ubica el ambi- ente",null,null,null,null,null,null,null,null,null,null,null,null,null,null,null,"¿Los SS.HH. están habilitados para personas con discapa- cidad?","(1)\n¿Existe un espacio libre de 0.80 m. x 1.20 m. al frente de cada aparato sanitario para una persona en silla de ruedas?","(2)\n\n¿Cuentan con barras de apoyo?","(3)\nCantidad de inodoros o water habilitados para una persona con discapacidad","(4)\nCantidad de lavatorios o lavamanos habilitados para una persona con discapacidad","Los SS.HH.\nson usados\npor:","Paredes",null,"Techo",null,"Piso",null,"Cantidad de letrinas",null,"(1)\n\n¿Cuenta con cubículos?","(2)\n\nCantidad \nTOTAL de \ncubículos","(3)\n\n¿Cuantos \ncubículos\ntienen \npuerta?","(1)\n\nCantidad","(2)\n\nMaterial\npredominante","(1)\nEl diseño y finalidad de uso de los inodoros y/o water de este ambiente es para:","(2) Cantidad de inodoros y/o water",null,"(3)\nDel Total operativos ¿Cuántos tienen función de descarga.","(1)\nINDIVIDUALES",null,"(2)\nCORRIDOS",null,"(1)\nINDIVIDUALES",null,null,"(2)\nCORRIDOS"]
[null,null,null,null,null,{"$f":"IF('Mod05'!G36<>\"\",'Mod05'!G36,\"X\")","v":"X"},null,"Nº","Nº de edifica- ción",null,"Detalle del ambiente usado como Servicio Higiénico","L","M","N","O","P","Q","R","S","T","U","V","W","X","Y",null,null,null,null,null,null,"(1)\n\nMaterial\npredominante","(2)\n\nEstado de conservación","(1)\n\nMaterial\npredominante","(2)\n\nEstado de conservación","(1)\n\nMaterial\npredominante","(2)\n\nEstado de conservación","(1)","(2)",null,null,null,null,null,null,"(1)","(2)",null,"Cantidad",null,"Cantidad",null,"Cantidad de urinarios",null,"(3)\nDel Total operativos ¿Cuántos tienen función de descarga.","Cantidad",null,"(3)\nDel Total operativos ¿Cuántos tienen función de descarga."]
[null,"Corr",null,null,null,{"$f":"IF('Mod05'!G37<>\"\",'Mod05'!G37,\"X\")","v":"X"},null,null,null,null,null,"A0","B0","F0","D1","D2","E0","E1","E2","L0","K0","T0","M0","P0","S0",null,null,null,null,null,"01. Sólo hombres\n02. Sólo mujeres\n03. Mixto",null,null,null,null,null,null,"Total","Operativas",null,null,null,null,null,null,"Total","Operativos",null,"(1)\nTotal","(2)\nOperativos","(1)\nTotal","(2)\nOperativos","(1)\nTotal","(2)\nOperativos",null,"(1)\nTotal","(2)\nOperativos"]
["TABLA - Espacios",1,null,{"$f":"IF($E17<>\"\",COUNTIF($E$17:$E$96,$E17),0)","v":0},{"$f":"CONCATENATE(I17,J17,LEFT(K17,3))","v":""},{"$f":"IF('Mod05'!G38<>\"\",'Mod05'!G38,\"X\")","v":"X"},null,{"$f":"IF(B17<=$Z$10,B17,\"\")","v":""},"","","","","","","","","","","","","","","","","","","","","","","","","","","","","","","","","","","","","","","","","","","","","","","","","","",""]
["129: SS.HH. SOLO PARA ESTUDIANTES",2,null,{"$f":"IF($E18<>\"\",COUNTIF($E$17:$E$96,$E18),0)","v":0},{"$f":"CONCATENATE(I18,J18,LEFT(K18,3))","v":""},{"$f":"IF('Mod05'!G39<>\"\",'Mod05'!G39,\"X\")","v":"X"},null,{"$f":"IF(B18<=$Z$10,B18,\"\")","v":""},"","","","","","","","","","","","","","","","","","","","","","","","","","","","","","","","","","","","","","","","","","","","","","","","","","",""]
["130: SS.HH. SOLO PARA DOCENTES",3,null,{"$f":"IF($E19<>\"\",COUNTIF($E$17:$E$96,$E19),0)","v":0},"",{"$f":"IF('Mod05'!G40<>\"\",'Mod05'!G40,\"X\")","v":"X"},null,{"$f":"IF(B19<=$Z$10,B19,\"\")","v":""},"","","","","","","","","","","","","","","","","","","","","","","","","","","","","","","","","","","","","","","","","","","","","","","","","","",""]
["131: SS.HH. SOLO PARA PERSONAL ADMINISTRATIVO",4,null,0,"",{"$f":"IF('Mod05'!G41<>\"\",'Mod05'!G41,\"X\")","v":"X"},null,"","","","","","","","","","","","","","","","","","","","","","","","","","","","","","","","","","","","","","","","","","","","","","","","","","","",""]
["132: SS.HH. PARA ESTUDIANTES Y DOCENTES",5,null,0,"",{"$f":"IF('Mod05'!G42<>\"\",'Mod05'!G42,\"X\")","v":"X"},null,"","","","","","","","","","","","","","","","","","","","","","","","","","","","","","","","","","","","","","","","","","","","","","","","","","","",""]
["133: SS.HH. PARA ESTUDIANTES Y ADMINISTRATIVOS",6,null,0,"",{"$f":"IF('Mod05'!G43<>\"\",'Mod05'!G43,\"X\")","v":"X"},null,"","","","","","","","","","","","","","","","","","","","","","","","","","","","","","","","","","","","","","","","","","","","","","","","","","","",""]
["134: SS.HH. PARA ESTUD., DOCENT. Y ADMINIST.",7,null,0,"",{"$f":"IF('Mod05'!G44<>\"\",'Mod05'!G44,\"X\")","v":"X"},null,"","","","","","","","","","","","","","","","","","","","","","","","","","","","","","","","","","","","","","","","","","","","","","","","","","","",""]
["135: SS.HH. PARA DOCENTES Y ADMINISTRATIVOS",8,null,0,"",{"$f":"IF('Mod05'!G45<>\"\",'Mod05'!G45,\"X\")","v":"X"},null,"","","","","","","","","","","","","","","","","","","","","","","","","","","","","","","","","","","","","","","","","","","","","","","","","","","",""]
["136: VESTIDORES PARA ESTUDIANTES",9,null,0,"",{"$f":"IF('Mod05'!G46<>\"\",'Mod05'!G46,\"X\")","v":"X"},null,"","","","","","","","","","","","","","","","","","","","","","","","","","","","","","","","","","","","","","","","","","","","","","","","","","","",""]
["137: VESTIDORES PARA DOCENTES Y ADMINISTRATIVO",10,null,0,"",{"$f":"IF('Mod05'!G47<>\"\",'Mod05'!G47,\"X\")","v":"X"},null,"","","","","","","","","","","","","","","","","","","","","","","","","","","","","","","","","","","","","","","","","","","","","","","","","","","",""]
[null,11,null,0,"",{"$f":"IF('Mod05'!G48<>\"\",'Mod05'!G48,\"X\")","v":"X"},null,"","","","","","","","","","","","","","","","","","","","","","","","","","","","","","","","","","","","","","","","","","","","","","","","","","","",""]
[null,12,null,0,"",{"$f":"IF('Mod05'!G49<>\"\",'Mod05'!G49,\"X\")","v":"X"},null,"","","","","","","","","","","","","","","","","","","","","","","","","","","","","","","","","","","","","","","","","","","","","","","","","","","",""]
[null,13,null,0,"",{"$f":"IF('Mod05'!G50<>\"\",'Mod05'!G50,\"X\")","v":"X"},null,"","","","","","","","","","","","","","","","","","","","","","","","","","","","","","","","","","","","","","","","","","","","","","","","","","","",""]
[null,14,null,0,"",{"$f":"IF('Mod05'!G51<>\"\",'Mod05'!G51,\"X\")","v":"X"},null,"","","","","","","","","","","","","","","","","","","","","","","","","","","","","","","","","","","","","","","","","","","","","","","","","","","",""]
["TABLA",15,null,0,"",{"$f":"IF('Mod05'!G52<>\"\",'Mod05'!G52,\"X\")","v":"X"},null,"","","","","","","","","","","","","","","","","","","","","","","","","","","","","","","","","","","","","","","","","","","","","","","","","","","",""]
["01: Sólo estudiantes",16,null,0,"",{"$f":"IF('Mod05'!G53<>\"\",'Mod05'!G53,\"X\")","v":"X"},null,"","","","","","","","","","","","","","","","","","","","","","","","","","","","","","","","","","","","","","","","","","","","","","","","","","","",""]
["02: Docentes y administrativos",17,null,0,"",{"$f":"IF('Mod05'!G54<>\"\",'Mod05'!G54,\"X\")","v":"X"},null,"","","","","","","","","","","","","","","","","","","","","","","","","","","","","","","","","","","","","","","","","","","","","","","","","","","",""]
["03: Estudiantes y Docentes",18,null,0,"",{"$f":"IF('Mod05'!G55<>\"\",'Mod05'!G55,\"X\")","v":"X"},null,"","","","","","","","","","","","","","","","","","","","","","","","","","","","","","","","","","","","","","","","","","","","","","","","","","","",""]
["04: Otros adultos",19,null,0,"",{"$f":"IF('Mod05'!G56<>\"\",'Mod05'!G56,\"X\")","v":"X"},null,"","","","","","","","","","","","","","","","","","","","","","","","","","","","","","","","","","","","","","","","","","","","","","","","","","","",""]
["05: Ninguno",20,null,0,"",{"$f":"IF('Mod05'!G57<>\"\",'Mod05'!G57,\"X\")","v":"X"},null,"","","","","","","","","","","","","","","","","","","","","","","","","","","","","","","","","","","","","","","","","","","","","","","","","","","",""]
[null,21,null,0,"",{"$f":"IF('Mod05'!G58<>\"\",'Mod05'!G58,\"X\")","v":"X"},null,"","","","","","","","","","","","","","","","","","","","","","","","","","","","","","","","","","","","","","","","","","","","","","","","","","","",""]
["TABLA",22,null,0,"",{"$f":"IF('Mod05'!G59<>\"\",'Mod05'!G59,\"X\")","v":"X"},null,"","","","","","","","","","","","","","","","","","","","","","","","","","","","","","","","","","","","","","","","","","","","","","","","","","","",""]
["01: Sólo hombres",23,null,0,"",{"$f":"IF('Mod05'!G60<>\"\",'Mod05'!G60,\"X\")","v":"X"},null,"","","","","","","","","","","","","","","","","","","","","","","","","","","","","","","","","","","","","","","","","","","","","","","","","","","",""]
["02: Sólo mujeres",24,null,0,"",{"$f":"IF('Mod05'!G61<>\"\",'Mod05'!G61,\"X\")","v":"X"},null,"","","","","","","","","","","","","","","","","","","","","","","","","","","","","","","","","","","","","","","","","","","","","","","","","","","",""]
["03: Mixto",25,null,0,"",{"$f":"IF('Mod05'!G62<>\"\",'Mod05'!G62,\"X\")","v":"X"},null,"","","","","","","","","","","","","","","","","","","","","","","","","","","","","","","","","","","","","","","","","","","","","","","","","","","",""]
[null,26,null,0,"",{"$f":"IF('Mod05'!G63<>\"\",'Mod05'!G63,\"X\")","v":"X"},null,"","","","","","","","","","","","","","","","","","","","","","","","","","","","","","","","","","","","","","","","","","","","","","","","","","","",""]
["Tabla 01",27,null,0,"",{"$f":"IF('Mod05'!G64<>\"\",'Mod05'!G64,\"X\")","v":"X"},null,"","","","","","","","","","","","","","","","","","","","","","","","","","","","","","","","","","","","","","","","","","","","","","","","","","","",""]
["01: Ladrillo o concreto",28,null,0,"",{"$f":"IF('Mod05'!G65<>\"\",'Mod05'!G65,\"X\")","v":"X"},null,"","","","","","","","","","","","","","","","","","","","","","","","","","","","","","","","","","","","","","","","","","","","","","","","","","","",""]
["02: Adobe o tapial",29,null,0,"",{"$f":"IF('Mod05'!G66<>\"\",'Mod05'!G66,\"X\")","v":"X"},null,"","","","","","","","","","","","","","","","","","","","","","","","","","","","","","","","","","","","","","","","","","","","","","","","","","","",""]
["03: Quincha",30,null,0,"",{"$f":"IF('Mod05'!G67<>\"\",'Mod05'!G67,\"X\")","v":"X"},null,"","","","","","","","","","","","","","","","","","","","","","","","","","","","","","","","","","","","","","","","","","","","","","","","","","","",""]
["04: Piedra con barro o cemento",31,null,0,"",{"$f":"IF('Mod05'!G68<>\"\",'Mod05'!G68,\"X\")","v":"X"},null,"","","","","","","","","","","","","","","","","","","","","","","","","","","","","","","","","","","","","","","","","","","","","","","","","","","",""]
["05: Madera",32,null,0,"",{"$f":"IF('Mod05'!G69<>\"\",'Mod05'!G69,\"X\")","v":"X"},null,"","","","","","","","","","","","","","","","","","","","","","","","","","","","","","","","","","","","","","","","","","","","","","","","","","","",""]
["06: Triplay",33,null,0,"",{"$f":"IF('Mod05'!G70<>\"\",'Mod05'!G70,\"X\")","v":"X"},null,"","","","","","","","","","","","","","","","","","","","","","","","","","","","","","","","","","","","","","","","","","","","","","","","","","","",""]
["07: Eternit o fibra concreto",34,null,0,"",{"$f":"IF('Mod05'!G71<>\"\",'Mod05'!G71,\"X\")","v":"X"},null,"","","","","","","","","","","","","","","","","","","","","","","","","","","","","","","","","","","","","","","","","","","","","","","","","","","",""]
["08: Estera, cartón o plástico",35,null,0,"",{"$f":"IF('Mod05'!G72<>\"\",'Mod05'!G72,\"X\")","v":"X"},null,"","","","","","","","","","","","","","","","","","","","","","","","","","","","","","","","","","","","","","","","","","","","","","","","","","","",""]
["09: Otro",36,null,0,"",{"$f":"IF('Mod05'!G73<>\"\",'Mod05'!G73,\"X\")","v":"X"},null,"","","","","","","","","","","","","","","","","","","","","","","","","","","","","","","","","","","","","","","","","","","","","","","","","","","",""]
["10: NT. pero lo requiere",37,null,0,"",{"$f":"IF('Mod05'!G74<>\"\",'Mod05'!G74,\"X\")","v":"X"},null,"","","","","","","","","","","","","","","","","","","","","","","","","","","","","","","","","","","","","","","","","","","","","","","","","","","",""]
["11: NT. y no lo requiere",38,null,0,"",{"$f":"IF('Mod05'!G75<>\"\",'Mod05'!G75,\"X\")","v":"X"},null,"","","","","","","","","","","","","","","","","","","","","","","","","","","","","","","","","","","","","","","","","","","","","","","","","","","",""]
[null,39,null,0,"",{"$f":"IF('Mod05'!G76<>\"\",'Mod05'!G76,\"X\")","v":"X"},null,"","","","","","","","","","","","","","","","","","","","","","","","","","","","","","","","","","","","","","","","","","","","","","","","","","","",""]
["Tabla 02 ",40,null,0,"",{"$f":"IF('Mod05'!G77<>\"\",'Mod05'!G77,\"X\")","v":"X"},null,"","","","","","","","","","","","","","","","","","","","","","","","","","","","","","","","","","","","","","","","","","","","","","","","","","","",""]
["01: Bueno",41,null,0,"",{"$f":"IF('Mod05'!G78<>\"\",'Mod05'!G78,\"X\")","v":"X"},null,"","","","","","","","","","","","","","","","","","","","","","","","","","","","","","","","","","","","","","","","","","","","","","","","","","","",""]
["02: Regular",42,null,0,"",{"$f":"IF('Mod05'!G79<>\"\",'Mod05'!G79,\"X\")","v":"X"},null,"","","","","","","","","","","","","","","","","","","","","","","","","","","","","","","","","","","","","","","","","","","","","","","","","","","",""]
["03: Malo",43,null,0,"",{"$f":"IF('Mod05'!G80<>\"\",'Mod05'!G80,\"X\")","v":"X"},null,"","","","","","","","","","","","","","","","","","","","","","","","","","","","","","","","","","","","","","","","","","","","","","","","","","","",""]
["04: No aplica",44,null,0,"",{"$f":"IF('Mod05'!G81<>\"\",'Mod05'!G81,\"X\")","v":"X"},null,"","","","","","","","","","","","","","","","","","","","","","","","","","","","","","","","","","","","","","","","","","","","","","","","","","","",""]
[null,45,null,0,"",{"$f":"IF('Mod05'!G82<>\"\",'Mod05'!G82,\"X\")","v":"X"},null,"","","","","","","","","","","","","","","","","","","","","","","","","","","","","","","","","","","","","","","","","","","","","","","","","","","",""]
["Tabla 03 ",46,null,0,"",{"$f":"IF('Mod05'!G83<>\"\",'Mod05'!G83,\"X\")","v":"X"},null,"","","","","","","","","","","","","","","","","","","","","","","","","","","","","","","","","","","","","","","","","","","","","","","","","","","",""]
["01: Concreto armado",47,null,0,"",{"$f":"IF('Mod05'!G84<>\"\",'Mod05'!G84,\"X\")","v":"X"},null,"","","","","","","","","","","","","","","","","","","","","","","","","","","","","","","","","","","","","","","","","","","","","","","","","","","",""]
["02: Madera",48,null,0,"",{"$f":"IF('Mod05'!G85<>\"\",'Mod05'!G85,\"X\")","v":"X"},null,"","","","","","","","","","","","","","","","","","","","","","","","","","","","","","","","","","","","","","","","","","","","","","","","","","","",""]
["03: Teja",49,null,0,"",{"$f":"IF('Mod05'!G86<>\"\",'Mod05'!G86,\"X\")","v":"X"},null,"","","","","","","","","","","","","","","","","","","","","","","","","","","","","","","","","","","","","","","","","","","","","","","","","","","",""]
["04: Fibra de cemento",50,null,0,"",{"$f":"IF('Mod05'!G87<>\"\",'Mod05'!G87,\"X\")","v":"X"},null,"","","","","","","","","","","","","","","","","","","","","","","","","","","","","","","","","","","","","","","","","","","","","","","","","","","",""]
["05: Calamina",51,null,0,"",{"$f":"IF('Mod05'!G88<>\"\",'Mod05'!G88,\"X\")","v":"X"},null,"","","","","","","","","","","","","","","","","","","","","","","","","","","","","","","","","","","","","","","","","","","","","","","","","","","",""]
["06: Calaminon",52,null,0,"",{"$f":"IF('Mod05'!G89<>\"\",'Mod05'!G89,\"X\")","v":"X"},null,"","","","","","","","","","","","","","","","","","","","","","","","","","","","","","","","","","","","","","","","","","","","","","","","","","","",""]
["07: Eternit",53,null,0,"",{"$f":"IF('Mod05'!G90<>\"\",'Mod05'!G90,\"X\")","v":"X"},null,"","","","","","","","","","","","","","","","","","","","","","","","","","","","","","","","","","","","","","","","","","","","","","","","","","","",""]
["08: Caña con barro",54,null,0,"",{"$f":"IF('Mod05'!G91<>\"\",'Mod05'!G91,\"X\")","v":"X"},null,"","","","","","","","","","","","","","","","","","","","","","","","","","","","","","","","","","","","","","","","","","","","","","","","","","","",""]
["09: Lata o latón",55,null,0,"",{"$f":"IF('Mod05'!G92<>\"\",'Mod05'!G92,\"X\")","v":"X"},null,"","","","","","","","","","","","","","","","","","","","","","","","","","","","","","","","","","","","","","","","","","","","","","","","","","","",""]
["10: Otro",56,null,0,"",{"$f":"IF('Mod05'!G93<>\"\",'Mod05'!G93,\"X\")","v":"X"},null,"","","","","","","","","","","","","","","","","","","","","","","","","","","","","","","","","","","","","","","","","","","","","","","","","","","",""]
["11: NT. pero lo requiere",57,null,0,"",{"$f":"IF('Mod05'!G94<>\"\",'Mod05'!G94,\"X\")","v":"X"},null,"","","","","","","","","","","","","","","","","","","","","","","","","","","","","","","","","","","","","","","","","","","","","","","","","","","",""]
["12: NT. y no lo requiere",58,null,0,"",{"$f":"IF('Mod05'!G95<>\"\",'Mod05'!G95,\"X\")","v":"X"},null,"","","","","","","","","","","","","","","","","","","","","","","","","","","","","","","","","","","","","","","","","","","","","","","","","","","",""]
[null,59,null,0,"",{"$f":"IF('Mod05'!G96<>\"\",'Mod05'!G96,\"X\")","v":"X"},null,"","","","","","","","","","","","","","","","","","","","","","","","","","","","","","","","","","","","","","","","","","","","","","","","","","","",""]
["Tabla 04",60,null,0,"",{"$f":"IF('Mod05'!G97<>\"\",'Mod05'!G97,\"X\")","v":"X"},null,"","","","","","","","","","","","","","","","","","","","","","","","","","","","","","","","","","","","","","","","","","","","","","","","","","","",""]
["01: Parquet o madera pulida",61,null,0,null,{"$f":"IF('Mod05'!G98<>\"\",'Mod05'!G98,\"X\")","v":"X"},null,"","","","","","","","","","","","","","","","","","","","","","","","","","","","","","","","","","","","","","","","","","","","","","","","","","","",""]
["02: Vinilico, pisopak o similar",62,null,0,null,{"$f":"IF('Mod05'!G99<>\"\",'Mod05'!G99,\"X\")","v":"X"},null,"","","","","","","","","","","","","","","","","","","","","","","","","","","","","","","","","","","","","","","","","","","","","","","","","","","",""]
["03: Loseta, cerámico o similar",63,null,0,null,{"$f":"IF('Mod05'!G100<>\"\",'Mod05'!G100,\"X\")","v":"X"},null,"","","","","","","","","","","","","","","","","","","","","","","","","","","","","","","","","","","","","","","","","","","","","","","","","","","",""]
["04: Cemento",64,null,0,null,{"$f":"IF('Mod05'!G101<>\"\",'Mod05'!G101,\"X\")","v":"X"},null,"","","","","","","","","","","","","","","","","","","","","","","","","","","","","","","","","","","","","","","","","","","","","","","","","","","",""]
["05: Madera entablado",65,null,0,null,{"$f":"IF('Mod05'!G102<>\"\",'Mod05'!G102,\"X\")","v":"X"},null,"","","","","","","","","","","","","","","","","","","","","","","","","","","","","","","","","","","","","","","","","","","","","","","","","","","",""]
["06: Tierra",66,null,0,null,{"$f":"IF('Mod05'!G103<>\"\",'Mod05'!G103,\"X\")","v":"X"},null,"","","","","","","","","","","","","","","","","","","","","","","","","","","","","","","","","","","","","","","","","","","","","","","","","","","",""]
["07: Otro",67,null,{"$f":"IF($E83<>\"\",COUNTIF($E$17:$E$96,$E83),0)","v":0},null,{"$f":"IF('Mod05'!G104<>\"\",'Mod05'!G104,\"X\")","v":"X"},null,{"$f":"IF(B83<=$Z$10,B83,\"\")","v":""},"","","","","","","","","","","","","","","","","","","","","","","","","","","","","","","","","","","","","","","","","","","","","","","","","","",""]
["08: NT. pero lo requiere",68,null,0,null,{"$f":"IF('Mod05'!G105<>\"\",'Mod05'!G105,\"X\")","v":"X"},null,"","","","","","","","","","","","","","","","","","","","","","","","","","","","","","","","","","","","","","","","","","","","","","","","","","","",""]
["09: NT. y no lo requiere",69,null,0,null,{"$f":"IF('Mod05'!G106<>\"\",'Mod05'!G106,\"X\")","v":"X"},null,"","","","","","","","","","","","","","","","","","","","","","","","","","","","","","","","","","","","","","","","","","","","","","","","","","","",""]
[null,70,null,0,null,{"$f":"IF('Mod05'!G107<>\"\",'Mod05'!G107,\"X\")","v":"X"},null,"","","","","","","","","","","","","","","","","","","","","","","","","","","","","","","","","","","","","","","","","","","","","","","","","","","",""]
[null,71,null,0,null,{"$f":"IF('Mod05'!G108<>\"\",'Mod05'!G108,\"X\")","v":"X"},null,"","","","","","","","","","","","","","","","","","","","","","","","","","","","","","","","","","","","","","","","","","","","","","","","","","","",""]
["01: Niños",72,null,0,null,{"$f":"IF('Mod05'!G109<>\"\",'Mod05'!G109,\"X\")","v":"X"},null,"","","","","","","","","","","","","","","","","","","","","","","","","","","","","","","","","","","","","","","","","","","","","","","","","","","",""]
["02: Adultos",73,null,0,null,{"$f":"IF('Mod05'!G110<>\"\",'Mod05'!G110,\"X\")","v":"X"},null,"","","","","","","","","","","","","","","","","","","","","","","","","","","","","","","","","","","","","","","","","","","","","","","","","","","",""]
[null,74,null,0,null,{"$f":"IF('Mod05'!G111<>\"\",'Mod05'!G111,\"X\")","v":"X"},null,"","","","","","","","","","","","","","","","","","","","","","","","","","","","","","","","","","","","","","","","","","","","","","","","","","","",""]
["Tabla : Si, No",75,null,0,null,{"$f":"IF('Mod05'!G112<>\"\",'Mod05'!G112,\"X\")","v":"X"},null,"","","","","","","","","","","","","","","","","","","","","","","","","","","","","","","","","","","","","","","","","","","","","","","","","","","",""]
["SI",76,null,0,null,{"$f":"IF('Mod05'!G113<>\"\",'Mod05'!G113,\"X\")","v":"X"},null,"","","","","","","","","","","","","","","","","","","","","","","","","","","","","","","","","","","","","","","","","","","","","","","","","","","",""]
["NO",77,null,0,null,{"$f":"IF('Mod05'!G114<>\"\",'Mod05'!G114,\"X\")","v":"X"},null,"","","","","","","","","","","","","","","","","","","","","","","","","","","","","","","","","","","","","","","","","","","","","","","","","","","",""]
[null,78,null,0,null,{"$f":"IF('Mod05'!G115<>\"\",'Mod05'!G115,\"X\")","v":"X"},null,"","","","","","","","","","","","","","","","","","","","","","","","","","","","","","","","","","","","","","","","","","","","","","","","","","","",""]
["Tabla 05",79,null,0,null,{"$f":"IF('Mod05'!G116<>\"\",'Mod05'!G116,\"X\")","v":"X"},null,"","","","","","","","","","","","","","","","","","","","","","","","","","","","","","","","","","","","","","","","","","","","","","","","","","","",""]
["01: Madera",80,null,0,null,{"$f":"IF('Mod05'!G117<>\"\",'Mod05'!G117,\"X\")","v":"X"},null,"","","","","","","","","","","","","","","","","","","","","","","","","","","","","","","","","","","","","","","","","","","","","","","","","","","",""]
["02: Mallas metálicas",null,null,null,null,{"$f":"IF('Mod05'!G118<>\"\",'Mod05'!G118,\"X\")","v":"X"},null,null,"","","","","","","","","","","","","","","","","","","","","","","","","","","","","","","","","","","","","","","","","","","","","","","","","","",""]
["03: Rejas metálicas",null,null,null,null,{"$f":"IF('Mod05'!G119<>\"\",'Mod05'!G119,\"X\")","v":"X"}]
["04: Planchas metálicas",null,null,null,null,null,null,null,"---","---","---",null,null,null,null,null,null,null,null,null,null,null,null,null,null,"---","---","---","---","---","---","---","---","---","---","---","---","---","---","---","---","---","---","---","---","---","---",null,"---","---","---","---","---"]
["05: Drywall"]
["06: Vidrio"]
["07: Otro"]
["08: No tiene, pero lo requiere"]
["09: No tiene y no requiere"]

{"sheet":"Mod09","index":10,"n_rows":72,"n_cols":14,"rows_kept":72,"cut":false,"hidden":false,"merged":[[13,5,16,5],[14,2,14,3],[36,5,38,5],[64,2,64,3],[61,2,61,3],[62,4,64,4],[36,4,38,4],[62,5,64,5],[12,2,12,3],[16,2,16,3],[37,2,37,3],[35,2,35,3],[13,4,16,4]]}
[]
[null,null,null,null,"CENSO EDUCATIVO 2026"]
[null,null,null,null,"LOCAL EDUCATIVO"]
[]
[]
[]
[null,"CAPÍTULO 9: RECURSOS TECNOLÓGICOS Y EQUIPAMIENTO EN EL LOCAL EDUCATIVO"]
[]
[null,null,"9.1. RECURSOS TECNOLÓGICOS:"]
[]
[null,null,null,"CUENTA CON AL MENOS UN RECURSO TECNOLÓGICO DE LA SIGUIENTE LISTA :",null,null,null,null,"SI",null,null,"NO"]
[]
[null,null,"(1)",null,"(2)","(3)"]
[null,null,null,null,"Cantidad total\n(OPERATIVOS\n+ INOPERATIVOS)","Cantidad de equipos\n\nOperativos"]
[null,"NRO","Recurso tecnológico"]
[]
[null,{"$f":"SUM(E18:F30)","v":0}]
[null,1,"PC de escritorio"]
[null,2,"Laptop convencional"]
[null,3,"Laptop XO"]
[null,4,"Servidor"]
[null,5,"Microservidor o Habilitador"]
[null,6,"Tablet - Aprendo en casa"]
[null,7,"Tablet - PRONATEL"]
[null,8,"Tablet - Otros"]
[null,9,"Proyector multimedia"]
[null,10,"Pizarra digital"]
[null,11,"Consola de audio para laboratorio de idiomas"]
[null,12,"Auriculares con audífonos y micrófono"]
[null,13,"Otros"]
[null,null,null,null,{"$f":"SUM(E18:E30)","v":0},0]
[null,null,"9.2. EQUIPAMIENTO"]
[]
[null,null,null,"CUENTA CON AL MENOS UN DISPOSITIVO DE LA SIGUIENTE LISTA :",null,null,null,null,"SI",null,null,"NO",null,""]
[]
[null,null,"(1)",null,"(2)","(3)"]
[null,"NRO",null,null,"Cantidad total\n(OPERATIVOS\n+ INOPERATIVOS)","Cantidad de equipos\n\nOperativos"]
[null,null,"Otros dispositivos"]
[null,{"$f":"SUM(E40:F56)","v":0}]
[null,1,"Televisor(es)"]
[null,2,"DVD / BLURAY"]
[null,3,"Radio, minicomponente"]
[null,4,"Equipo de sonido (Consolas separadas)"]
[null,5,"Parlante portátil"]
[null,6,"Parlante pasivo (Necesita amplificador para fun ...)"]
[null,7,"Sólo fotocopiadora"]
[null,8,"Sólo escáner"]
[null,9,"Sólo impresora"]
[null,10,"Multifuncional (Fotocopia, escanea e imprime)"]
[null,11,"Pantalla de proyección ECRAN"]
[null,12,"Kits de robótica educativa"]
[null,13,"Equipos de Talleres Ligeros"]
[null,14,"Equipos de Talleres Pesados"]
[null,15,"Equipos de aire acondicionado y/o climatización"]
[null,16,"Extractores de aire"]
[null,17,"Otros"]
[null,null,null,null,{"$f":"SUM(E40:E56)","v":0},{"$f":"SUM(F40:F56)","v":0}]
[null,null,"9.3. EQUIPOS DE INTERCONEXIÓN Y PROTECCIÓN DE ENERGÍA"]
[]
[null,null,null,"CUENTA CON AL MENOS UN EQUIPO DE LA SIGUIENTE LISTA :",null,null,null,null,"SI",null,null,"NO"]
[]
[null,null,"(1)",null,"(2)","(3)"]
[null,"NRO",null,null,"Cantidad total\n(OPERATIVOS\n+ INOPERATIVOS)","Cantidad de equipos\n\nOperativos"]
[]
[null,{"$f":"SUM(E66:E71)","v":0},"Equipos de interconexión y protección"]
[null,1,"Switch para red"]
[null,2,"Modem"]
[null,3,"Router"]
[null,4,"Access Point"]
[null,5,"UPS"]
[null,6,"Estabilizadores"]
[null,null,null,null,{"$f":"SUM(E66:E71)","v":0},{"$f":"SUM(F66:F71)","v":0}]

{"sheet":"Mod10","index":11,"n_rows":71,"n_cols":9,"rows_kept":71,"cut":false,"hidden":false,"merged":[[1,5,1,8],[2,5,2,8],[8,5,8,9],[8,3,8,4]]}
[]
[null,null,null,null,null,"CENSO EDUCATIVO 2026"]
[null,null,null,null,null,"LOCAL EDUCATIVO"]
[]
[]
[]
[null,null,null,"ANOTACIONES COMPLEMENTARIAS QUE CONSIDERE IMPORTANTE AGREGAR"]
[]
[null,null,null,"Longitud máxima 200 caracteres"]
[]
[]
[null,null,null,"PERSONAL RESPONSABLE DEL LLENADO DE LA FICHA"]
[]
[null,null,null,"Nombres:",null,null,null,null,"Apellidos:"]
[]
[null,null,null,"Profesión:",null,null,null,null,"N° de colegiatura:"]
[]
[null,null,null,"Correo electrónico:",null,null,null,null,"Cargo:"]
[]
[null,null,null,null,null,null,null,null,"Teléfono celular:"]
[]
[null,null,null,"COMPLETE DATOS DE CONTACTO DEL DIRECTOR DE LA INSTITUCIÓN EDUCATIVA (EN EL CASO DE QUE LA FICHA NO HAYA SIDO COMPLETADA POR EL DIRECTOR)"]
[]
[null,null,null,"Correo electrónico:",null,null,null,{"$f":"IF(AND(J18<>\"\",J18<>\"DIRECTOR(A)\"),\"X\",\"\")","v":""},"Teléfono celular:"]
[]
[]
[null,null,null,null,null,"Declaro haber revisado con detenimiento el instructivo brindado por la DIGEIE y la Unidad de Estadística"]
[]
[]
[]
[]
["ESPECIALISTA"]
["DIRECTOR(A)"]
["SUB DIRECTOR(A)"]
["DOCENTE"]
["COORDINADOR(A)"]
["ASESOR"]
["ADMINISTRATIVO"]
["ASISTENTE"]
["AUXILIAR"]
["SECRETARIA(O)"]
["ESTADÍSTICO"]
["ESPECIALISTA"]
["BIBLIOTECARIO"]
["CARE"]
["COMANDANTE PNP"]
["CONTADOR"]
["DAIP"]
["DIGITADOR(A)"]
["GERENTE"]
["JEFE ACADÉMICO"]
["JEFE ADMINISTRATIVO"]
["JEFE DE AREA"]
["JEFE DE LABORATORIO"]
["JEFE DE PERSONAL"]
["JEFE DE SEDE"]
["JEFE UNIDAD"]
["OFICINISTA"]
["OPERADOR DE SISTEMAS"]
["PERSONAL DE SERVICIO"]
["PROGRAMADOR"]
["PROMOTOR(A)"]
["PSICOLOGO"]
["REGISTRADOR(A)"]
["REPRESENTANTE LEGAL"]
["SOPORTE TECNOLOGICO"]
["TÉCNICO ADMINISTRATIVO"]
["TESORERO(A)"]
["TRABAJADOR SOCIAL"]
["TUTOR"]
["OTROS"]

{"sheet":"Enviar","index":12,"n_rows":10,"n_cols":4,"rows_kept":10,"cut":false,"hidden":false,"merged":[[1,2,1,3],[2,2,2,3]]}
[]
[null,null,"CENSO EDUCATIVO 2026"]
[null,null,"LOCAL EDUCATIVO"]
[]
[]
[null,null,"Paso 1:","Realice el ENVÍO con su clave EOL."]
[]
[null,null,"Paso 2:","Una vez realizado el ENVÍO,  Revise su constancia de envio."]
[]
[null,null,"  ADVERTENCIA","ASEGÚRESE DE REGISTRAR TODA LA INFORMACIÓN DEL NIVEL INFORMANTE"]

{"sheet":"Ubigeo_UGEL","index":13,"n_rows":1895,"n_cols":8,"rows_kept":1895,"cut":false,"hidden":false,"merged":[]}
[null,"CÓDIGOS DE UBICACIÓN GEOGRÁFICA",null,null,null,null,"CÓDIGOS DE DRE Y UGEL"]
[]
[null,"CÓDIGO","DEPARTAMENTO","PROVINCIA","DISTRITO",null,"CÓDIGO","DENOMINACIÓN DE DRE O UGEL"]
[null,"010101","AMAZONAS","CHACHAPOYAS","CHACHAPOYAS",null,"010000","DRE AMAZONAS"]
[null,"010102","AMAZONAS","CHACHAPOYAS","ASUNCION",null,"010001","UGEL Chachapoyas"]
[null,"010103","AMAZONAS","CHACHAPOYAS","BALSAS",null,"010002","UGEL Bagua"]
[null,"010104","AMAZONAS","CHACHAPOYAS","CHETO",null,"010003","UGEL Bongara"]
[null,"010105","AMAZONAS","CHACHAPOYAS","CHILIQUIN",null,"010004","UGEL Condorcanqui"]
[null,"010106","AMAZONAS","CHACHAPOYAS","CHUQUIBAMBA",null,"010005","UGEL Luya"]
[null,"010107","AMAZONAS","CHACHAPOYAS","GRANADA",null,"010006","UGEL Rodriguez de Mendoza"]
[null,"010108","AMAZONAS","CHACHAPOYAS","HUANCAS",null,"010007","UGEL Utcubamba"]
[null,"010109","AMAZONAS","CHACHAPOYAS","LA JALCA",null,"010009","UGEL IBIR-IMAZA"]
[null,"010110","AMAZONAS","CHACHAPOYAS","LEIMEBAMBA",null,"010010","UGEL Intercultural Bilingüe Rio Santiago"]
[null,"010111","AMAZONAS","CHACHAPOYAS","LEVANTO",null,"010011","UGEL Intercultural Bilingüe Cenepa"]
[null,"010112","AMAZONAS","CHACHAPOYAS","MAGDALENA",null,"020000","DRE ANCASH"]
[null,"010113","AMAZONAS","CHACHAPOYAS","MARISCAL CASTILLA",null,"020001","UGEL Huaraz"]
[null,"010114","AMAZONAS","CHACHAPOYAS","MOLINOPAMPA",null,"020002","UGEL Aija"]
[null,"010115","AMAZONAS","CHACHAPOYAS","MONTEVIDEO",null,"020003","UGEL Antonio Raymondi"]
[null,"010116","AMAZONAS","CHACHAPOYAS","OLLEROS",null,"020004","UGEL Asuncion"]
[null,"010117","AMAZONAS","CHACHAPOYAS","QUINJALCA",null,"020005","UGEL Bolognesi"]
[null,"010118","AMAZONAS","CHACHAPOYAS","SAN FRANCISCO DE DAGUAS",null,"020006","UGEL Carhuaz"]
[null,"010119","AMAZONAS","CHACHAPOYAS","SAN ISIDRO DE MAINO",null,"020007","UGEL Carlos Fermin Fitzcarrald"]
[null,"010120","AMAZONAS","CHACHAPOYAS","SOLOCO",null,"020008","UGEL Casma"]
[null,"010121","AMAZONAS","CHACHAPOYAS","SONCHE",null,"020009","UGEL Corongo"]
[null,"010201","AMAZONAS","BAGUA","BAGUA",null,"020010","UGEL Huari"]
[null,"010202","AMAZONAS","BAGUA","ARAMANGO",null,"020011","UGEL Huarmey"]
[null,"010203","AMAZONAS","BAGUA","COPALLIN",null,"020012","UGEL Huaylas"]
[null,"010204","AMAZONAS","BAGUA","EL PARCO",null,"020013","UGEL Mariscal Luzuriaga"]
[null,"010205","AMAZONAS","BAGUA","IMAZA",null,"020014","UGEL Ocros"]
[null,"010206","AMAZONAS","BAGUA","LA PECA",null,"020015","UGEL Pallasca"]
[null,"010301","AMAZONAS","BONGARA","JUMBILLA",null,"020016","UGEL Pomabamba"]
[null,"010302","AMAZONAS","BONGARA","CHISQUILLA",null,"020017","UGEL Recuay"]
[null,"010303","AMAZONAS","BONGARA","CHURUJA",null,"020018","UGEL Santa"]
[null,"010304","AMAZONAS","BONGARA","COROSHA",null,"020019","UGEL Sihuas"]
[null,"010305","AMAZONAS","BONGARA","CUISPES",null,"020020","UGEL Yungay"]
[null,"010306","AMAZONAS","BONGARA","FLORIDA",null,"030000","DRE APURIMAC"]
[null,"010307","AMAZONAS","BONGARA","JAZAN",null,"030001","UGEL Abancay"]
[null,"010308","AMAZONAS","BONGARA","RECTA",null,"030002","UGEL Andahuaylas"]
[null,"010309","AMAZONAS","BONGARA","SAN CARLOS",null,"030003","UGEL Antabamba"]
[null,"010310","AMAZONAS","BONGARA","SHIPASBAMBA",null,"030004","UGEL Aymaraes"]
[null,"010311","AMAZONAS","BONGARA","VALERA",null,"030005","UGEL Cotabambas"]
[null,"010312","AMAZONAS","BONGARA","YAMBRASBAMBA",null,"030006","UGEL Chincheros"]
[null,"010401","AMAZONAS","CONDORCANQUI","NIEVA",null,"030007","UGEL Grau"]
[null,"010402","AMAZONAS","CONDORCANQUI","EL CENEPA",null,"030008","UGEL Huancarama"]
[null,"010403","AMAZONAS","CONDORCANQUI","RIO SANTIAGO",null,"040000","GRE AREQUIPA"]
[null,"010501","AMAZONAS","LUYA","LAMUD",null,"040001","UGEL Arequipa Norte"]
[null,"010502","AMAZONAS","LUYA","CAMPORREDONDO",null,"040002","UGEL Arequipa Sur"]
[null,"010503","AMAZONAS","LUYA","COCABAMBA",null,"040003","UGEL Camana"]
[null,"010504","AMAZONAS","LUYA","COLCAMAR",null,"040004","UGEL Caraveli"]
[null,"010505","AMAZONAS","LUYA","CONILA",null,"040005","UGEL Castilla"]
[null,"010506","AMAZONAS","LUYA","INGUILPATA",null,"040006","UGEL Caylloma"]
[null,"010507","AMAZONAS","LUYA","LONGUITA",null,"040007","UGEL Condesuyos"]
[null,"010508","AMAZONAS","LUYA","LONYA CHICO",null,"040008","UGEL Islay"]
[null,"010509","AMAZONAS","LUYA","LUYA",null,"040009","UGEL La Union"]
[null,"010510","AMAZONAS","LUYA","LUYA VIEJO",null,"040010","UGEL La Joya"]
[null,"010511","AMAZONAS","LUYA","MARIA",null,"050000","DRE AYACUCHO"]
[null,"010512","AMAZONAS","LUYA","OCALLI",null,"050001","UGEL Huamanga"]
[null,"010513","AMAZONAS","LUYA","OCUMAL",null,"050002","UGEL Cangallo"]
[null,"010514","AMAZONAS","LUYA","PISUQUIA",null,"050003","UGEL Huancasancos"]
[null,"010515","AMAZONAS","LUYA","PROVIDENCIA",null,"050004","UGEL Huanta"]
[null,"010516","AMAZONAS","LUYA","SAN CRISTOBAL",null,"050005","UGEL La Mar"]
[null,"010517","AMAZONAS","LUYA","SAN FRANCISCO DEL YESO",null,"050006","UGEL Lucanas"]
[null,"010518","AMAZONAS","LUYA","SAN JERONIMO",null,"050007","UGEL Parinacochas"]
[null,"010519","AMAZONAS","LUYA","SAN JUAN DE LOPECANCHA",null,"050008","UGEL Paucar del Sarasara"]
[null,"010520","AMAZONAS","LUYA","SANTA CATALINA",null,"050009","UGEL Sucre"]
[null,"010521","AMAZONAS","LUYA","SANTO TOMAS",null,"050010","UGEL Victor Fajardo"]
[null,"010522","AMAZONAS","LUYA","TINGO",null,"050011","UGEL Vilcashuaman"]
[null,"010523","AMAZONAS","LUYA","TRITA",null,"060000","DRE CAJAMARCA"]
[null,"010601","AMAZONAS","RODRIGUEZ DE MENDOZA","SAN NICOLAS",null,"060001","UGEL Cajamarca"]
[null,"010602","AMAZONAS","RODRIGUEZ DE MENDOZA","CHIRIMOTO",null,"060002","UGEL Cajabamba"]
[null,"010603","AMAZONAS","RODRIGUEZ DE MENDOZA","COCHAMAL",null,"060003","UGEL Celendin"]
[null,"010604","AMAZONAS","RODRIGUEZ DE MENDOZA","HUAMBO",null,"060004","UGEL Chota"]
[null,"010605","AMAZONAS","RODRIGUEZ DE MENDOZA","LIMABAMBA",null,"060005","UGEL Contumaza"]
[null,"010606","AMAZONAS","RODRIGUEZ DE MENDOZA","LONGAR",null,"060006","UGEL Cutervo"]
[null,"010607","AMAZONAS","RODRIGUEZ DE MENDOZA","MARISCAL BENAVIDES",null,"060007","UGEL Hualgayoc"]
[null,"010608","AMAZONAS","RODRIGUEZ DE MENDOZA","MILPUC",null,"060008","UGEL Jaen"]
[null,"010609","AMAZONAS","RODRIGUEZ DE MENDOZA","OMIA",null,"060009","UGEL San Ignacio"]
[null,"010610","AMAZONAS","RODRIGUEZ DE MENDOZA","SANTA ROSA",null,"060010","UGEL San Marcos"]
[null,"010611","AMAZONAS","RODRIGUEZ DE MENDOZA","TOTORA",null,"060011","UGEL San Miguel"]
[null,"010612","AMAZONAS","RODRIGUEZ DE MENDOZA","VISTA ALEGRE",null,"060012","UGEL San Pablo"]
[null,"010701","AMAZONAS","UTCUBAMBA","BAGUA GRANDE",null,"060013","UGEL Santa Cruz"]
[null,"010702","AMAZONAS","UTCUBAMBA","CAJARURO",null,"070101","DRE CALLAO"]
[null,"010703","AMAZONAS","UTCUBAMBA","CUMBA",null,"070102","UGEL Ventanilla"]
[null,"010704","AMAZONAS","UTCUBAMBA","EL MILAGRO",null,"070103","UGEL Callao"]
[null,"010705","AMAZONAS","UTCUBAMBA","JAMALCA",null,"080000","DRE CUSCO"]
[null,"010706","AMAZONAS","UTCUBAMBA","LONYA GRANDE",null,"080001","UGEL Cusco"]
[null,"010707","AMAZONAS","UTCUBAMBA","YAMON",null,"080002","UGEL Acomayo"]
[null,"020101","ANCASH","HUARAZ","HUARAZ",null,"080003","UGEL Anta"]
[null,"020102","ANCASH","HUARAZ","COCHABAMBA",null,"080004","UGEL Calca"]
[null,"020103","ANCASH","HUARAZ","COLCABAMBA",null,"080005","UGEL Canas"]
[null,"020104","ANCASH","HUARAZ","HUANCHAY",null,"080006","UGEL Canchis"]
[null,"020105","ANCASH","HUARAZ","INDEPENDENCIA",null,"080007","UGEL Chumbivilcas"]
[null,"020106","ANCASH","HUARAZ","JANGAS",null,"080008","UGEL Espinar"]
[null,"020107","ANCASH","HUARAZ","LA LIBERTAD",null,"080009","UGEL La Convencion"]
[null,"020108","ANCASH","HUARAZ","OLLEROS",null,"080010","UGEL Paruro"]
[null,"020109","ANCASH","HUARAZ","PAMPAS GRANDE",null,"080011","UGEL Paucartambo"]
[null,"020110","ANCASH","HUARAZ","PARIACOTO",null,"080012","UGEL Quispicanchi"]
[null,"020111","ANCASH","HUARAZ","PIRA",null,"080013","UGEL Urubamba"]
[null,"020112","ANCASH","HUARAZ","TARICA",null,"080014","UGEL Pichari-Kimbiri"]
[null,"020201","ANCASH","AIJA","AIJA",null,"090000","DRE HUANCAVELICA"]
[null,"020202","ANCASH","AIJA","CORIS",null,"090001","UGEL Huancavelica"]
[null,"020203","ANCASH","AIJA","HUACLLAN",null,"090002","UGEL Acobamba"]
[null,"020204","ANCASH","AIJA","LA MERCED",null,"090003","UGEL Angaraes"]
[null,"020205","ANCASH","AIJA","SUCCHA",null,"090004","UGEL Castrovirreyna"]
[null,"020301","ANCASH","ANTONIO RAYMONDI","LLAMELLIN",null,"090005","UGEL Churcampa"]
[null,"020302","ANCASH","ANTONIO RAYMONDI","ACZO",null,"090006","UGEL Huaytara"]
[null,"020303","ANCASH","ANTONIO RAYMONDI","CHACCHO",null,"090007","UGEL Tayacaja"]
[null,"020304","ANCASH","ANTONIO RAYMONDI","CHINGAS",null,"090009","UGEL Surcubamba"]
[null,"020305","ANCASH","ANTONIO RAYMONDI","MIRGAS",null,"100000","DRE HUANUCO"]
[null,"020306","ANCASH","ANTONIO RAYMONDI","SAN JUAN DE RONTOY",null,"100001","UGEL Huanuco"]
[null,"020401","ANCASH","ASUNCION","CHACAS",null,"100002","UGEL Ambo"]
[null,"020402","ANCASH","ASUNCION","ACOCHACA",null,"100003","UGEL Dos de Mayo"]
[null,"020501","ANCASH","BOLOGNESI","CHIQUIAN",null,"100004","UGEL Lauricocha"]
[null,"020502","ANCASH","BOLOGNESI","ABELARDO PARDO LEZAMETA",null,"100005","UGEL Yarowilca"]
[null,"020503","ANCASH","BOLOGNESI","ANTONIO RAYMONDI",null,"100006","UGEL Huacaybamba"]
[null,"020504","ANCASH","BOLOGNESI","AQUIA",null,"100007","UGEL Huamalies"]
[null,"020505","ANCASH","BOLOGNESI","CAJACAY",null,"100008","UGEL Leoncio Prado"]
[null,"020506","ANCASH","BOLOGNESI","CANIS",null,"100009","UGEL Marañon"]
[null,"020507","ANCASH","BOLOGNESI","COLQUIOC",null,"100010","UGEL Pachitea"]
[null,"020508","ANCASH","BOLOGNESI","HUALLANCA",null,"100011","UGEL Puerto Inca"]
[null,"020509","ANCASH","BOLOGNESI","HUASTA",null,"110000","DRE ICA"]
[null,"020510","ANCASH","BOLOGNESI","HUAYLLACAYAN",null,"110001","UGEL Ica"]
[null,"020511","ANCASH","BOLOGNESI","LA PRIMAVERA",null,"110002","UGEL Chincha"]
[null,"020512","ANCASH","BOLOGNESI","MANGAS",null,"110003","UGEL Nasca"]
[null,"020513","ANCASH","BOLOGNESI","PACLLON",null,"110004","UGEL Palpa"]
[null,"020514","ANCASH","BOLOGNESI","SAN MIGUEL DE CORPANQUI",null,"110005","UGEL Pisco"]
[null,"020515","ANCASH","BOLOGNESI","TICLLOS",null,"120000","DRE JUNIN"]
[null,"020601","ANCASH","CARHUAZ","CARHUAZ",null,"120001","UGEL Huancayo"]
[null,"020602","ANCASH","CARHUAZ","ACOPAMPA",null,"120002","UGEL Chupaca"]
[null,"020603","ANCASH","CARHUAZ","AMASHCA",null,"120003","UGEL Concepcion"]
[null,"020604","ANCASH","CARHUAZ","ANTA",null,"120004","UGEL Chanchamayo"]
[null,"020605","ANCASH","CARHUAZ","ATAQUERO",null,"120005","UGEL Jauja"]
[null,"020606","ANCASH","CARHUAZ","MARCARA",null,"120006","UGEL Junin"]
[null,"020607","ANCASH","CARHUAZ","PARIAHUANCA",null,"120007","UGEL Satipo"]
[null,"020608","ANCASH","CARHUAZ","SAN MIGUEL DE ACO",null,"120008","UGEL Tarma"]
[null,"020609","ANCASH","CARHUAZ","SHILLA",null,"120009","UGEL Yauli"]
[null,"020610","ANCASH","CARHUAZ","TINCO",null,"120010","UGEL Pangoa"]
[null,"020611","ANCASH","CARHUAZ","YUNGAR",null,"120011","UGEL Pichanaki"]
[null,"020701","ANCASH","CARLOS FERMIN FITZCARRALD","SAN LUIS",null,"120012","UGEL Rio Tambo"]
[null,"020702","ANCASH","CARLOS FERMIN FITZCARRALD","SAN NICOLAS",null,"120014","UGEL Rio Ene - Mantaro"]
[null,"020703","ANCASH","CARLOS FERMIN FITZCARRALD","YAUYA",null,"130000","GRE LA LIBERTAD"]
[null,"020801","ANCASH","CASMA","CASMA",null,"130002","UGEL Viru"]
[null,"020802","ANCASH","CASMA","BUENA VISTA ALTA",null,"130003","UGEL Ascope"]
[null,"020803","ANCASH","CASMA","COMANDANTE NOEL",null,"130004","UGEL Bolivar"]
[null,"020804","ANCASH","CASMA","YAUTAN",null,"130005","UGEL Chepen"]
[null,"020901","ANCASH","CORONGO","CORONGO",null,"130006","UGEL Julcan"]
[null,"020902","ANCASH","CORONGO","ACO",null,"130007","UGEL Otuzco"]
[null,"020903","ANCASH","CORONGO","BAMBAS",null,"130008","UGEL Pacasmayo"]
[null,"020904","ANCASH","CORONGO","CUSCA",null,"130009","UGEL Pataz"]
[null,"020905","ANCASH","CORONGO","LA PAMPA",null,"130010","UGEL Sanchez Carrion"]
[null,"020906","ANCASH","CORONGO","YANAC",null,"130011","UGEL Santiago de Chuco"]
[null,"020907","ANCASH","CORONGO","YUPAN",null,"130012","UGEL Gran Chimu"]
[null,"021001","ANCASH","HUARI","HUARI",null,"130014","UGEL 01 - El Porvenir"]
[null,"021002","ANCASH","HUARI","ANRA",null,"130015","UGEL 02 - La Esperanza"]
[null,"021003","ANCASH","HUARI","CAJAY",null,"130016","UGEL 03 - Trujillo Nor Oeste"]
[null,"021004","ANCASH","HUARI","CHAVIN DE HUANTAR",null,"130017","UGEL 04 - Trujillo Sur Este"]
[null,"021005","ANCASH","HUARI","HUACACHI",null,"140000","GRE LAMBAYEQUE"]
[null,"021006","ANCASH","HUARI","HUACCHIS",null,"140001","UGEL Chiclayo"]
[null,"021007","ANCASH","HUARI","HUACHIS",null,"140002","UGEL Ferreñafe"]
[null,"021008","ANCASH","HUARI","HUANTAR",null,"140003","UGEL Lambayeque"]
[null,"021009","ANCASH","HUARI","MASIN",null,"150101","DRE DE LIMA METROPOLITANA"]
[null,"021010","ANCASH","HUARI","PAUCAS",null,"150102","UGEL 01 San Juan de Miraflores"]
[null,"021011","ANCASH","HUARI","PONTO",null,"150103","UGEL 02 Rimac"]
[null,"021012","ANCASH","HUARI","RAHUAPAMPA",null,"150104","UGEL 03 Breña"]
[null,"021013","ANCASH","HUARI","RAPAYAN",null,"150105","UGEL 04 Comas"]
[null,"021014","ANCASH","HUARI","SAN MARCOS",null,"150106","UGEL 05 San Juan de Lurigancho"]
[null,"021015","ANCASH","HUARI","SAN PEDRO DE CHANA",null,"150107","UGEL 06 Ate"]
[null,"021016","ANCASH","HUARI","UCO",null,"150108","UGEL 07 San Borja"]
[null,"021101","ANCASH","HUARMEY","HUARMEY",null,"150200","DRE DE LIMA PROVINCIAS"]
[null,"021102","ANCASH","HUARMEY","COCHAPETI",null,"150201","UGEL 08 Cañete"]
[null,"021103","ANCASH","HUARMEY","CULEBRAS",null,"150202","UGEL 09 Huaura"]
[null,"021104","ANCASH","HUARMEY","HUAYAN",null,"150203","UGEL 10 Huaral"]
[null,"021105","ANCASH","HUARMEY","MALVAS",null,"150204","UGEL 11 Cajatambo"]
[null,"021201","ANCASH","HUAYLAS","CARAZ",null,"150205","UGEL 12 Canta"]
[null,"021202","ANCASH","HUAYLAS","HUALLANCA",null,"150206","UGEL 13 Yauyos"]
[null,"021203","ANCASH","HUAYLAS","HUATA",null,"150207","UGEL 14 Oyon"]
[null,"021204","ANCASH","HUAYLAS","HUAYLAS",null,"150208","UGEL 15 Huarochiri"]
[null,"021205","ANCASH","HUAYLAS","MATO",null,"150209","UGEL 16 Barranca"]
[null,"021206","ANCASH","HUAYLAS","PAMPAROMAS",null,"160000","DRE LORETO"]
[null,"021207","ANCASH","HUAYLAS","PUEBLO LIBRE",null,"160001","UGEL Maynas"]
[null,"021208","ANCASH","HUAYLAS","SANTA CRUZ",null,"160002","UGEL Alto Amazonas-Yurimaguas"]
[null,"021209","ANCASH","HUAYLAS","SANTO TORIBIO",null,"160003","UGEL Alto Amazonas-San Lorenzo"]
[null,"021210","ANCASH","HUAYLAS","YURACMARCA",null,"160004","UGEL Loreto - Nauta"]
[null,"021301","ANCASH","MARISCAL LUZURIAGA","PISCOBAMBA",null,"160005","UGEL Ramon Castilla-Caballococha"]
[null,"021302","ANCASH","MARISCAL LUZURIAGA","CASCA",null,"160006","UGEL Requena"]
[null,"021303","ANCASH","MARISCAL LUZURIAGA","ELEAZAR GUZMAN BARRON",null,"160007","UGEL Ucayali-Contamana"]
[null,"021304","ANCASH","MARISCAL LUZURIAGA","FIDEL OLIVAS ESCUDERO",null,"160008","UGEL Putumayo"]
[null,"021305","ANCASH","MARISCAL LUZURIAGA","LLAMA",null,"160011","UGEL Datem del Marañon Intercultural Bilingüe"]
[null,"021306","ANCASH","MARISCAL LUZURIAGA","LLUMPA",null,"170000","DRE MADRE DE DIOS"]
[null,"021307","ANCASH","MARISCAL LUZURIAGA","LUCMA",null,"170001","UGEL Tambopata"]
[null,"021308","ANCASH","MARISCAL LUZURIAGA","MUSGA",null,"170002","UGEL Manu"]
[null,"021401","ANCASH","OCROS","OCROS",null,"170003","UGEL Tahuamanu"]
[null,"021402","ANCASH","OCROS","ACAS",null,"180000","DRE MOQUEGUA"]
[null,"021403","ANCASH","OCROS","CAJAMARQUILLA",null,"180001","UGEL Mariscal Nieto"]
[null,"021404","ANCASH","OCROS","CARHUAPAMPA",null,"180002","UGEL General Sánchez Cerro"]
[null,"021405","ANCASH","OCROS","COCHAS",null,"180003","UGEL Ilo"]
[null,"021406","ANCASH","OCROS","CONGAS",null,"180005","UGEL San Ignacio de Loyola - Ichuña"]
[null,"021407","ANCASH","OCROS","LLIPA",null,"190000","DRE PASCO"]
[null,"021408","ANCASH","OCROS","SAN CRISTOBAL DE RAJAN",null,"190001","UGEL Pasco"]
[null,"021409","ANCASH","OCROS","SAN PEDRO",null,"190002","UGEL Daniel Alcides Carrión"]
[null,"021410","ANCASH","OCROS","SANTIAGO DE CHILCAS",null,"190003","UGEL Oxapampa"]
[null,"021501","ANCASH","PALLASCA","CABANA",null,"190006","UGEL Puerto Bermudez"]
[null,"021502","ANCASH","PALLASCA","BOLOGNESI",null,"200000","DRE PIURA"]
[null,"021503","ANCASH","PALLASCA","CONCHUCOS",null,"200001","UGEL Piura"]
[null,"021504","ANCASH","PALLASCA","HUACASCHUQUE",null,"200002","UGEL Tambogrande"]
[null,"021505","ANCASH","PALLASCA","HUANDOVAL",null,"200003","UGEL La Unión"]
[null,"021506","ANCASH","PALLASCA","LACABAMBA",null,"200004","UGEL Sechura"]
[null,"021507","ANCASH","PALLASCA","LLAPO",null,"200005","UGEL Ayabaca"]
[null,"021508","ANCASH","PALLASCA","PALLASCA",null,"200006","UGEL Huancabamba"]
[null,"021509","ANCASH","PALLASCA","PAMPAS",null,"200007","UGEL Chulucanas"]
[null,"021510","ANCASH","PALLASCA","SANTA ROSA",null,"200008","UGEL Morropón"]
[null,"021511","ANCASH","PALLASCA","TAUCA",null,"200009","UGEL Paita"]
[null,"021601","ANCASH","POMABAMBA","POMABAMBA",null,"200010","UGEL Sullana"]
[null,"021602","ANCASH","POMABAMBA","HUAYLLAN",null,"200011","UGEL Talara"]
[null,"021603","ANCASH","POMABAMBA","PAROBAMBA",null,"200012","UGEL HUARMACA"]
[null,"021604","ANCASH","POMABAMBA","QUINUABAMBA",null,"210000","DRE PUNO"]
[null,"021701","ANCASH","RECUAY","RECUAY",null,"210001","UGEL Puno"]
[null,"021702","ANCASH","RECUAY","CATAC",null,"210002","UGEL Azángaro"]
[null,"021703","ANCASH","RECUAY","COTAPARACO",null,"210003","UGEL Carabaya"]
[null,"021704","ANCASH","RECUAY","HUAYLLAPAMPA",null,"210004","UGEL El Collao"]
[null,"021705","ANCASH","RECUAY","LLACLLIN",null,"210005","UGEL Chucuito"]
[null,"021706","ANCASH","RECUAY","MARCA",null,"210006","UGEL Huancané"]
[null,"021707","ANCASH","RECUAY","PAMPAS CHICO",null,"210007","UGEL San Antonio de Putina"]
[null,"021708","ANCASH","RECUAY","PARARIN",null,"210008","UGEL Moho"]
[null,"021709","ANCASH","RECUAY","TAPACOCHA",null,"210009","UGEL Lampa"]
[null,"021710","ANCASH","RECUAY","TICAPAMPA",null,"210010","UGEL Melgar"]
[null,"021801","ANCASH","SANTA","CHIMBOTE",null,"210011","UGEL San Román"]
[null,"021802","ANCASH","SANTA","CACERES DEL PERU",null,"210012","UGEL Sandia"]
[null,"021803","ANCASH","SANTA","COISHCO",null,"210013","UGEL Yunguyo"]
[null,"021804","ANCASH","SANTA","MACATE",null,"210014","UGEL Crucero"]
[null,"021805","ANCASH","SANTA","MORO",null,"220000","DRE SAN MARTIN"]
[null,"021806","ANCASH","SANTA","NEPEÑA",null,"220001","UGEL Moyobamba"]
[null,"021807","ANCASH","SANTA","SAMANCO",null,"220002","UGEL Bellavista"]
[null,"021808","ANCASH","SANTA","SANTA",null,"220003","UGEL Huallaga"]
[null,"021809","ANCASH","SANTA","NUEVO CHIMBOTE",null,"220004","UGEL Lamas"]
[null,"021901","ANCASH","SIHUAS","SIHUAS",null,"220005","UGEL El Dorado"]
[null,"021902","ANCASH","SIHUAS","ACOBAMBA",null,"220006","UGEL Mariscal Cáceres"]
[null,"021903","ANCASH","SIHUAS","ALFONSO UGARTE",null,"220007","UGEL Picota"]
[null,"021904","ANCASH","SIHUAS","CASHAPAMPA",null,"220008","UGEL Rioja"]
[null,"021905","ANCASH","SIHUAS","CHINGALPO",null,"220009","UGEL San Martín"]
[null,"021906","ANCASH","SIHUAS","HUAYLLABAMBA",null,"220010","UGEL Tocache"]
[null,"021907","ANCASH","SIHUAS","QUICHES",null,"230000","DRE TACNA"]
[null,"021908","ANCASH","SIHUAS","RAGASH",null,"230001","UGEL Tacna"]
[null,"021909","ANCASH","SIHUAS","SAN JUAN",null,"230002","UGEL Jorge Basadre"]
[null,"021910","ANCASH","SIHUAS","SICSIBAMBA",null,"230003","UGEL Tarata"]
[null,"022001","ANCASH","YUNGAY","YUNGAY",null,"230004","UGEL Candarave"]
[null,"022002","ANCASH","YUNGAY","CASCAPARA",null,"240000","DRE TUMBES"]
[null,"022003","ANCASH","YUNGAY","MANCOS",null,"240001","UGEL Tumbes"]
[null,"022004","ANCASH","YUNGAY","MATACOTO",null,"240002","UGEL Contralmirante Villar"]
[null,"022005","ANCASH","YUNGAY","QUILLO",null,"240003","UGEL Zarumilla"]
[null,"022006","ANCASH","YUNGAY","RANRAHIRCA",null,"250000","DRE UCAYALI"]
[null,"022007","ANCASH","YUNGAY","SHUPLUY",null,"250001","UGEL Coronel Portillo"]
[null,"022008","ANCASH","YUNGAY","YANAMA",null,"250002","UGEL Atalaya"]
[null,"030101","APURIMAC","ABANCAY","ABANCAY",null,"250003","UGEL Padre Abad"]
[null,"030102","APURIMAC","ABANCAY","CHACOCHE",null,"250004","UGEL Purus"]
[null,"030103","APURIMAC","ABANCAY","CIRCA"]
[null,"030104","APURIMAC","ABANCAY","CURAHUASI"]
[null,"030105","APURIMAC","ABANCAY","HUANIPACA"]
[null,"030106","APURIMAC","ABANCAY","LAMBRAMA"]
[null,"030107","APURIMAC","ABANCAY","PICHIRHUA"]
[null,"030108","APURIMAC","ABANCAY","SAN PEDRO DE CACHORA"]
[null,"030109","APURIMAC","ABANCAY","TAMBURCO"]
[null,"030201","APURIMAC","ANDAHUAYLAS","ANDAHUAYLAS"]
[null,"030202","APURIMAC","ANDAHUAYLAS","ANDARAPA"]
[null,"030203","APURIMAC","ANDAHUAYLAS","CHIARA"]
[null,"030204","APURIMAC","ANDAHUAYLAS","HUANCARAMA"]
[null,"030205","APURIMAC","ANDAHUAYLAS","HUANCARAY"]
[null,"030206","APURIMAC","ANDAHUAYLAS","HUAYANA"]
[null,"030207","APURIMAC","ANDAHUAYLAS","KISHUARA"]
[null,"030208","APURIMAC","ANDAHUAYLAS","PACOBAMBA"]
[null,"030209","APURIMAC","ANDAHUAYLAS","PACUCHA"]
[null,"030210","APURIMAC","ANDAHUAYLAS","PAMPACHIRI"]
[null,"030211","APURIMAC","ANDAHUAYLAS","POMACOCHA"]
[null,"030212","APURIMAC","ANDAHUAYLAS","SAN ANTONIO DE CACHI"]
[null,"030213","APURIMAC","ANDAHUAYLAS","SAN JERONIMO"]
[null,"030214","APURIMAC","ANDAHUAYLAS","SAN MIGUEL DE CHACCRAMPA"]
[null,"030215","APURIMAC","ANDAHUAYLAS","SANTA MARIA DE CHICMO"]
[null,"030216","APURIMAC","ANDAHUAYLAS","TALAVERA"]
[null,"030217","APURIMAC","ANDAHUAYLAS","TUMAY HUARACA"]
[null,"030218","APURIMAC","ANDAHUAYLAS","TURPO"]
[null,"030219","APURIMAC","ANDAHUAYLAS","KAQUIABAMBA"]
[null,"030220","APURIMAC","ANDAHUAYLAS","JOSE MARIA ARGUEDAS"]
[null,"030301","APURIMAC","ANTABAMBA","ANTABAMBA"]
[null,"030302","APURIMAC","ANTABAMBA","EL ORO"]
[null,"030303","APURIMAC","ANTABAMBA","HUAQUIRCA"]
[null,"030304","APURIMAC","ANTABAMBA","JUAN ESPINOZA MEDRANO"]
[null,"030305","APURIMAC","ANTABAMBA","OROPESA"]
[null,"030306","APURIMAC","ANTABAMBA","PACHACONAS"]
[null,"030307","APURIMAC","ANTABAMBA","SABAINO"]
[null,"030401","APURIMAC","AYMARAES","CHALHUANCA"]
[null,"030402","APURIMAC","AYMARAES","CAPAYA"]
[null,"030403","APURIMAC","AYMARAES","CARAYBAMBA"]
[null,"030404","APURIMAC","AYMARAES","CHAPIMARCA"]
[null,"030405","APURIMAC","AYMARAES","COLCABAMBA"]
[null,"030406","APURIMAC","AYMARAES","COTARUSE"]
[null,"030407","APURIMAC","AYMARAES","IHUAYLLO"]
[null,"030408","APURIMAC","AYMARAES","JUSTO APU SAHUARAURA"]
[null,"030409","APURIMAC","AYMARAES","LUCRE"]
[null,"030410","APURIMAC","AYMARAES","POCOHUANCA"]
[null,"030411","APURIMAC","AYMARAES","SAN JUAN DE CHACÑA"]
[null,"030412","APURIMAC","AYMARAES","SAÑAYCA"]
[null,"030413","APURIMAC","AYMARAES","SORAYA"]
[null,"030414","APURIMAC","AYMARAES","TAPAIRIHUA"]
[null,"030415","APURIMAC","AYMARAES","TINTAY"]
[null,"030416","APURIMAC","AYMARAES","TORAYA"]
[null,"030417","APURIMAC","AYMARAES","YANACA"]
[null,"030501","APURIMAC","COTABAMBAS","TAMBOBAMBA"]
[null,"030502","APURIMAC","COTABAMBAS","COTABAMBAS"]
[null,"030503","APURIMAC","COTABAMBAS","COYLLURQUI"]
[null,"030504","APURIMAC","COTABAMBAS","HAQUIRA"]
[null,"030505","APURIMAC","COTABAMBAS","MARA"]
[null,"030506","APURIMAC","COTABAMBAS","CHALLHUAHUACHO"]
[null,"030601","APURIMAC","CHINCHEROS","CHINCHEROS"]
[null,"030602","APURIMAC","CHINCHEROS","ANCO_HUALLO"]
[null,"030603","APURIMAC","CHINCHEROS","COCHARCAS"]
[null,"030604","APURIMAC","CHINCHEROS","HUACCANA"]
[null,"030605","APURIMAC","CHINCHEROS","OCOBAMBA"]
[null,"030606","APURIMAC","CHINCHEROS","ONGOY"]
[null,"030607","APURIMAC","CHINCHEROS","URANMARCA"]
[null,"030608","APURIMAC","CHINCHEROS","RANRACANCHA"]
[null,"030609","APURIMAC","CHINCHEROS","ROCCHACC"]
[null,"030610","APURIMAC","CHINCHEROS","EL PORVENIR"]
[null,"030611","APURIMAC","CHINCHEROS","LOS CHANKAS"]
[null,"030612","APURIMAC","CHINCHEROS","AHUAYRO"]
[null,"030701","APURIMAC","GRAU","CHUQUIBAMBILLA"]
[null,"030702","APURIMAC","GRAU","CURPAHUASI"]
[null,"030703","APURIMAC","GRAU","GAMARRA"]
[null,"030704","APURIMAC","GRAU","HUAYLLATI"]
[null,"030705","APURIMAC","GRAU","MAMARA"]
[null,"030706","APURIMAC","GRAU","MICAELA BASTIDAS"]
[null,"030707","APURIMAC","GRAU","PATAYPAMPA"]
[null,"030708","APURIMAC","GRAU","PROGRESO"]
[null,"030709","APURIMAC","GRAU","SAN ANTONIO"]
[null,"030710","APURIMAC","GRAU","SANTA ROSA"]
[null,"030711","APURIMAC","GRAU","TURPAY"]
[null,"030712","APURIMAC","GRAU","VILCABAMBA"]
[null,"030713","APURIMAC","GRAU","VIRUNDO"]
[null,"030714","APURIMAC","GRAU","CURASCO"]
[null,"040101","AREQUIPA","AREQUIPA","AREQUIPA"]
[null,"040102","AREQUIPA","AREQUIPA","ALTO SELVA ALEGRE"]
[null,"040103","AREQUIPA","AREQUIPA","CAYMA"]
[null,"040104","AREQUIPA","AREQUIPA","CERRO COLORADO"]
[null,"040105","AREQUIPA","AREQUIPA","CHARACATO"]
[null,"040106","AREQUIPA","AREQUIPA","CHIGUATA"]
[null,"040107","AREQUIPA","AREQUIPA","JACOBO HUNTER"]
[null,"040108","AREQUIPA","AREQUIPA","LA JOYA"]
[null,"040109","AREQUIPA","AREQUIPA","MARIANO MELGAR"]
[null,"040110","AREQUIPA","AREQUIPA","MIRAFLORES"]
[null,"040111","AREQUIPA","AREQUIPA","MOLLEBAYA"]
[null,"040112","AREQUIPA","AREQUIPA","PAUCARPATA"]
[null,"040113","AREQUIPA","AREQUIPA","POCSI"]
[null,"040114","AREQUIPA","AREQUIPA","POLOBAYA"]
[null,"040115","AREQUIPA","AREQUIPA","QUEQUEÑA"]
[null,"040116","AREQUIPA","AREQUIPA","SABANDIA"]
[null,"040117","AREQUIPA","AREQUIPA","SACHACA"]
[null,"040118","AREQUIPA","AREQUIPA","SAN JUAN DE SIGUAS"]
[null,"040119","AREQUIPA","AREQUIPA","SAN JUAN DE TARUCANI"]
[null,"040120","AREQUIPA","AREQUIPA","SANTA ISABEL DE SIGUAS"]
[null,"040121","AREQUIPA","AREQUIPA","SANTA RITA DE SIGUAS"]
[null,"040122","AREQUIPA","AREQUIPA","SOCABAYA"]
[null,"040123","AREQUIPA","AREQUIPA","TIABAYA"]
[null,"040124","AREQUIPA","AREQUIPA","UCHUMAYO"]
[null,"040125","AREQUIPA","AREQUIPA","VITOR"]
[null,"040126","AREQUIPA","AREQUIPA","YANAHUARA"]
[null,"040127","AREQUIPA","AREQUIPA","YARABAMBA"]
[null,"040128","AREQUIPA","AREQUIPA","YURA"]
[null,"040129","AREQUIPA","AREQUIPA","JOSE LUIS BUSTAMANTE Y RIVERO"]
[null,"040201","AREQUIPA","CAMANA","CAMANA"]
[null,"040202","AREQUIPA","CAMANA","JOSE MARIA QUIMPER"]
[null,"040203","AREQUIPA","CAMANA","MARIANO NICOLAS VALCARCEL"]
[null,"040204","AREQUIPA","CAMANA","MARISCAL CACERES"]
[null,"040205","AREQUIPA","CAMANA","NICOLAS DE PIEROLA"]
[null,"040206","AREQUIPA","CAMANA","OCOÑA"]
[null,"040207","AREQUIPA","CAMANA","QUILCA"]
[null,"040208","AREQUIPA","CAMANA","SAMUEL PASTOR"]
[null,"040301","AREQUIPA","CARAVELI","CARAVELI"]
[null,"040302","AREQUIPA","CARAVELI","ACARI"]
[null,"040303","AREQUIPA","CARAVELI","ATICO"]
[null,"040304","AREQUIPA","CARAVELI","ATIQUIPA"]
[null,"040305","AREQUIPA","CARAVELI","BELLA UNION"]
[null,"040306","AREQUIPA","CARAVELI","CAHUACHO"]
[null,"040307","AREQUIPA","CARAVELI","CHALA"]
[null,"040308","AREQUIPA","CARAVELI","CHAPARRA"]
[null,"040309","AREQUIPA","CARAVELI","HUANUHUANU"]
[null,"040310","AREQUIPA","CARAVELI","JAQUI"]
[null,"040311","AREQUIPA","CARAVELI","LOMAS"]
[null,"040312","AREQUIPA","CARAVELI","QUICACHA"]
[null,"040313","AREQUIPA","CARAVELI","YAUCA"]
[null,"040401","AREQUIPA","CASTILLA","APLAO"]
[null,"040402","AREQUIPA","CASTILLA","ANDAGUA"]
[null,"040403","AREQUIPA","CASTILLA","AYO"]
[null,"040404","AREQUIPA","CASTILLA","CHACHAS"]
[null,"040405","AREQUIPA","CASTILLA","CHILCAYMARCA"]
[null,"040406","AREQUIPA","CASTILLA","CHOCO"]
[null,"040407","AREQUIPA","CASTILLA","HUANCARQUI"]
[null,"040408","AREQUIPA","CASTILLA","MACHAGUAY"]
[null,"040409","AREQUIPA","CASTILLA","ORCOPAMPA"]
[null,"040410","AREQUIPA","CASTILLA","PAMPACOLCA"]
[null,"040411","AREQUIPA","CASTILLA","TIPAN"]
[null,"040412","AREQUIPA","CASTILLA","UÑON"]
[null,"040413","AREQUIPA","CASTILLA","URACA"]
[null,"040414","AREQUIPA","CASTILLA","VIRACO"]
[null,"040501","AREQUIPA","CAYLLOMA","CHIVAY"]
[null,"040502","AREQUIPA","CAYLLOMA","ACHOMA"]
[null,"040503","AREQUIPA","CAYLLOMA","CABANACONDE"]
[null,"040504","AREQUIPA","CAYLLOMA","CALLALLI"]
[null,"040505","AREQUIPA","CAYLLOMA","CAYLLOMA"]
[null,"040506","AREQUIPA","CAYLLOMA","COPORAQUE"]
[null,"040507","AREQUIPA","CAYLLOMA","HUAMBO"]
[null,"040508","AREQUIPA","CAYLLOMA","HUANCA"]
[null,"040509","AREQUIPA","CAYLLOMA","ICHUPAMPA"]
[null,"040510","AREQUIPA","CAYLLOMA","LARI"]
[null,"040511","AREQUIPA","CAYLLOMA","LLUTA"]
[null,"040512","AREQUIPA","CAYLLOMA","MACA"]
[null,"040513","AREQUIPA","CAYLLOMA","MADRIGAL"]
[null,"040514","AREQUIPA","CAYLLOMA","SAN ANTONIO DE CHUCA"]
[null,"040515","AREQUIPA","CAYLLOMA","SIBAYO"]
[null,"040516","AREQUIPA","CAYLLOMA","TAPAY"]
[null,"040517","AREQUIPA","CAYLLOMA","TISCO"]
[null,"040518","AREQUIPA","CAYLLOMA","TUTI"]
[null,"040519","AREQUIPA","CAYLLOMA","YANQUE"]
[null,"040520","AREQUIPA","CAYLLOMA","MAJES"]
[null,"040601","AREQUIPA","CONDESUYOS","CHUQUIBAMBA"]
[null,"040602","AREQUIPA","CONDESUYOS","ANDARAY"]
[null,"040603","AREQUIPA","CONDESUYOS","CAYARANI"]
[null,"040604","AREQUIPA","CONDESUYOS","CHICHAS"]
[null,"040605","AREQUIPA","CONDESUYOS","IRAY"]
[null,"040606","AREQUIPA","CONDESUYOS","RIO GRANDE"]
[null,"040607","AREQUIPA","CONDESUYOS","SALAMANCA"]
[null,"040608","AREQUIPA","CONDESUYOS","YANAQUIHUA"]
[null,"040701","AREQUIPA","ISLAY","MOLLENDO"]
[null,"040702","AREQUIPA","ISLAY","COCACHACRA"]
[null,"040703","AREQUIPA","ISLAY","DEAN VALDIVIA"]
[null,"040704","AREQUIPA","ISLAY","ISLAY"]
[null,"040705","AREQUIPA","ISLAY","MEJIA"]
[null,"040706","AREQUIPA","ISLAY","PUNTA DE BOMBON"]
[null,"040801","AREQUIPA","LA UNION","COTAHUASI"]
[null,"040802","AREQUIPA","LA UNION","ALCA"]
[null,"040803","AREQUIPA","LA UNION","CHARCANA"]
[null,"040804","AREQUIPA","LA UNION","HUAYNACOTAS"]
[null,"040805","AREQUIPA","LA UNION","PAMPAMARCA"]
[null,"040806","AREQUIPA","LA UNION","PUYCA"]
[null,"040807","AREQUIPA","LA UNION","QUECHUALLA"]
[null,"040808","AREQUIPA","LA UNION","SAYLA"]
[null,"040809","AREQUIPA","LA UNION","TAURIA"]
[null,"040810","AREQUIPA","LA UNION","TOMEPAMPA"]
[null,"040811","AREQUIPA","LA UNION","TORO"]
[null,"050101","AYACUCHO","HUAMANGA","AYACUCHO"]
[null,"050102","AYACUCHO","HUAMANGA","ACOCRO"]
[null,"050103","AYACUCHO","HUAMANGA","ACOS VINCHOS"]
[null,"050104","AYACUCHO","HUAMANGA","CARMEN ALTO"]
[null,"050105","AYACUCHO","HUAMANGA","CHIARA"]
[null,"050106","AYACUCHO","HUAMANGA","OCROS"]
[null,"050107","AYACUCHO","HUAMANGA","PACAYCASA"]
[null,"050108","AYACUCHO","HUAMANGA","QUINUA"]
[null,"050109","AYACUCHO","HUAMANGA","SAN JOSE DE TICLLAS"]
[null,"050110","AYACUCHO","HUAMANGA","SAN JUAN BAUTISTA"]
[null,"050111","AYACUCHO","HUAMANGA","SANTIAGO DE PISCHA"]
[null,"050112","AYACUCHO","HUAMANGA","SOCOS"]
[null,"050113","AYACUCHO","HUAMANGA","TAMBILLO"]
[null,"050114","AYACUCHO","HUAMANGA","VINCHOS"]
[null,"050115","AYACUCHO","HUAMANGA","JESUS NAZARENO"]
[null,"050116","AYACUCHO","HUAMANGA","ANDRES AVELINO CACERES DORREGARAY"]
[null,"050201","AYACUCHO","CANGALLO","CANGALLO"]
[null,"050202","AYACUCHO","CANGALLO","CHUSCHI"]
[null,"050203","AYACUCHO","CANGALLO","LOS MOROCHUCOS"]
[null,"050204","AYACUCHO","CANGALLO","MARIA PARADO DE BELLIDO"]
[null,"050205","AYACUCHO","CANGALLO","PARAS"]
[null,"050206","AYACUCHO","CANGALLO","TOTOS"]
[null,"050301","AYACUCHO","HUANCA SANCOS","SANCOS"]
[null,"050302","AYACUCHO","HUANCA SANCOS","CARAPO"]
[null,"050303","AYACUCHO","HUANCA SANCOS","SACSAMARCA"]
[null,"050304","AYACUCHO","HUANCA SANCOS","SANTIAGO DE LUCANAMARCA"]
[null,"050401","AYACUCHO","HUANTA","HUANTA"]
[null,"050402","AYACUCHO","HUANTA","AYAHUANCO"]
[null,"050403","AYACUCHO","HUANTA","HUAMANGUILLA"]
[null,"050404","AYACUCHO","HUANTA","IGUAIN"]
[null,"050405","AYACUCHO","HUANTA","LURICOCHA"]
[null,"050406","AYACUCHO","HUANTA","SANTILLANA"]
[null,"050407","AYACUCHO","HUANTA","SIVIA"]
[null,"050408","AYACUCHO","HUANTA","LLOCHEGUA"]
[null,"050409","AYACUCHO","HUANTA","CANAYRE"]
[null,"050410","AYACUCHO","HUANTA","UCHURACCAY"]
[null,"050411","AYACUCHO","HUANTA","PUCACOLPA"]
[null,"050412","AYACUCHO","HUANTA","CHACA"]
[null,"050413","AYACUCHO","HUANTA","PUTIS"]
[null,"050501","AYACUCHO","LA MAR","SAN MIGUEL"]
[null,"050502","AYACUCHO","LA MAR","ANCO"]
[null,"050503","AYACUCHO","LA MAR","AYNA"]
[null,"050504","AYACUCHO","LA MAR","CHILCAS"]
[null,"050505","AYACUCHO","LA MAR","CHUNGUI"]
[null,"050506","AYACUCHO","LA MAR","LUIS CARRANZA"]
[null,"050507","AYACUCHO","LA MAR","SANTA ROSA"]
[null,"050508","AYACUCHO","LA MAR","TAMBO"]
[null,"050509","AYACUCHO","LA MAR","SAMUGARI"]
[null,"050510","AYACUCHO","LA MAR","ANCHIHUAY"]
[null,"050511","AYACUCHO","LA MAR","ORONCCOY"]
[null,"050512","AYACUCHO","LA MAR","UNION PROGRESO"]
[null,"050513","AYACUCHO","LA MAR","RIO MAGDALENA"]
[null,"050514","AYACUCHO","LA MAR","NINABAMBA"]
[null,"050515","AYACUCHO","LA MAR","PATIBAMBA"]
[null,"050601","AYACUCHO","LUCANAS","PUQUIO"]
[null,"050602","AYACUCHO","LUCANAS","AUCARA"]
[null,"050603","AYACUCHO","LUCANAS","CABANA"]
[null,"050604","AYACUCHO","LUCANAS","CARMEN SALCEDO"]
[null,"050605","AYACUCHO","LUCANAS","CHAVIÑA"]
[null,"050606","AYACUCHO","LUCANAS","CHIPAO"]
[null,"050607","AYACUCHO","LUCANAS","HUAC-HUAS"]
[null,"050608","AYACUCHO","LUCANAS","LARAMATE"]
[null,"050609","AYACUCHO","LUCANAS","LEONCIO PRADO"]
[null,"050610","AYACUCHO","LUCANAS","LLAUTA"]
[null,"050611","AYACUCHO","LUCANAS","LUCANAS"]
[null,"050612","AYACUCHO","LUCANAS","OCAÑA"]
[null,"050613","AYACUCHO","LUCANAS","OTOCA"]
[null,"050614","AYACUCHO","LUCANAS","SAISA"]
[null,"050615","AYACUCHO","LUCANAS","SAN CRISTOBAL"]
[null,"050616","AYACUCHO","LUCANAS","SAN JUAN"]
[null,"050617","AYACUCHO","LUCANAS","SAN PEDRO"]
[null,"050618","AYACUCHO","LUCANAS","SAN PEDRO DE PALCO"]
[null,"050619","AYACUCHO","LUCANAS","SANCOS"]
[null,"050620","AYACUCHO","LUCANAS","SANTA ANA DE HUAYCAHUACHO"]
[null,"050621","AYACUCHO","LUCANAS","SANTA LUCIA"]
[null,"050701","AYACUCHO","PARINACOCHAS","CORACORA"]
[null,"050702","AYACUCHO","PARINACOCHAS","CHUMPI"]
[null,"050703","AYACUCHO","PARINACOCHAS","CORONEL CASTAÑEDA"]
[null,"050704","AYACUCHO","PARINACOCHAS","PACAPAUSA"]
[null,"050705","AYACUCHO","PARINACOCHAS","PULLO"]
[null,"050706","AYACUCHO","PARINACOCHAS","PUYUSCA"]
[null,"050707","AYACUCHO","PARINACOCHAS","SAN FRANCISCO DE RAVACAYCO"]
[null,"050708","AYACUCHO","PARINACOCHAS","UPAHUACHO"]
[null,"050801","AYACUCHO","PAUCAR DEL SARA SARA","PAUSA"]
[null,"050802","AYACUCHO","PAUCAR DEL SARA SARA","COLTA"]
[null,"050803","AYACUCHO","PAUCAR DEL SARA SARA","CORCULLA"]
[null,"050804","AYACUCHO","PAUCAR DEL SARA SARA","LAMPA"]
[null,"050805","AYACUCHO","PAUCAR DEL SARA SARA","MARCABAMBA"]
[null,"050806","AYACUCHO","PAUCAR DEL SARA SARA","OYOLO"]
[null,"050807","AYACUCHO","PAUCAR DEL SARA SARA","PARARCA"]
[null,"050808","AYACUCHO","PAUCAR DEL SARA SARA","SAN JAVIER DE ALPABAMBA"]
[null,"050809","AYACUCHO","PAUCAR DEL SARA SARA","SAN JOSE DE USHUA"]
[null,"050810","AYACUCHO","PAUCAR DEL SARA SARA","SARA SARA"]
[null,"050901","AYACUCHO","SUCRE","QUEROBAMBA"]
[null,"050902","AYACUCHO","SUCRE","BELEN"]
[null,"050903","AYACUCHO","SUCRE","CHALCOS"]
[null,"050904","AYACUCHO","SUCRE","CHILCAYOC"]
[null,"050905","AYACUCHO","SUCRE","HUACAÑA"]
[null,"050906","AYACUCHO","SUCRE","MORCOLLA"]
[null,"050907","AYACUCHO","SUCRE","PAICO"]
[null,"050908","AYACUCHO","SUCRE","SAN PEDRO DE LARCAY"]
[null,"050909","AYACUCHO","SUCRE","SAN SALVADOR DE QUIJE"]
[null,"050910","AYACUCHO","SUCRE","SANTIAGO DE PAUCARAY"]
[null,"050911","AYACUCHO","SUCRE","SORAS"]
[null,"051001","AYACUCHO","VICTOR FAJARDO","HUANCAPI"]
[null,"051002","AYACUCHO","VICTOR FAJARDO","ALCAMENCA"]
[null,"051003","AYACUCHO","VICTOR FAJARDO","APONGO"]
[null,"051004","AYACUCHO","VICTOR FAJARDO","ASQUIPATA"]
[null,"051005","AYACUCHO","VICTOR FAJARDO","CANARIA"]
[null,"051006","AYACUCHO","VICTOR FAJARDO","CAYARA"]
[null,"051007","AYACUCHO","VICTOR FAJARDO","COLCA"]
[null,"051008","AYACUCHO","VICTOR FAJARDO","HUAMANQUIQUIA"]
[null,"051009","AYACUCHO","VICTOR FAJARDO","HUANCARAYLLA"]
[null,"051010","AYACUCHO","VICTOR FAJARDO","HUALLA"]
[null,"051011","AYACUCHO","VICTOR FAJARDO","SARHUA"]
[null,"051012","AYACUCHO","VICTOR FAJARDO","VILCANCHOS"]
[null,"051101","AYACUCHO","VILCAS HUAMAN","VILCAS HUAMAN"]
[null,"051102","AYACUCHO","VILCAS HUAMAN","ACCOMARCA"]
[null,"051103","AYACUCHO","VILCAS HUAMAN","CARHUANCA"]
[null,"051104","AYACUCHO","VILCAS HUAMAN","CONCEPCION"]
[null,"051105","AYACUCHO","VILCAS HUAMAN","HUAMBALPA"]
[null,"051106","AYACUCHO","VILCAS HUAMAN","INDEPENDENCIA"]
[null,"051107","AYACUCHO","VILCAS HUAMAN","SAURAMA"]
[null,"051108","AYACUCHO","VILCAS HUAMAN","VISCHONGO"]
[null,"060101","CAJAMARCA","CAJAMARCA","CAJAMARCA"]
[null,"060102","CAJAMARCA","CAJAMARCA","ASUNCION"]
[null,"060103","CAJAMARCA","CAJAMARCA","CHETILLA"]
[null,"060104","CAJAMARCA","CAJAMARCA","COSPAN"]
[null,"060105","CAJAMARCA","CAJAMARCA","ENCAÑADA"]
[null,"060106","CAJAMARCA","CAJAMARCA","JESUS"]
[null,"060107","CAJAMARCA","CAJAMARCA","LLACANORA"]
[null,"060108","CAJAMARCA","CAJAMARCA","LOS BAÑOS DEL INCA"]
[null,"060109","CAJAMARCA","CAJAMARCA","MAGDALENA"]
[null,"060110","CAJAMARCA","CAJAMARCA","MATARA"]
[null,"060111","CAJAMARCA","CAJAMARCA","NAMORA"]
[null,"060112","CAJAMARCA","CAJAMARCA","SAN JUAN"]
[null,"060201","CAJAMARCA","CAJABAMBA","CAJABAMBA"]
[null,"060202","CAJAMARCA","CAJABAMBA","CACHACHI"]
[null,"060203","CAJAMARCA","CAJABAMBA","CONDEBAMBA"]
[null,"060204","CAJAMARCA","CAJABAMBA","SITACOCHA"]
[null,"060301","CAJAMARCA","CELENDIN","CELENDIN"]
[null,"060302","CAJAMARCA","CELENDIN","CHUMUCH"]
[null,"060303","CAJAMARCA","CELENDIN","CORTEGANA"]
[null,"060304","CAJAMARCA","CELENDIN","HUASMIN"]
[null,"060305","CAJAMARCA","CELENDIN","JORGE CHAVEZ"]
[null,"060306","CAJAMARCA","CELENDIN","JOSE GALVEZ"]
[null,"060307","CAJAMARCA","CELENDIN","MIGUEL IGLESIAS"]
[null,"060308","CAJAMARCA","CELENDIN","OXAMARCA"]
[null,"060309","CAJAMARCA","CELENDIN","SOROCHUCO"]
[null,"060310","CAJAMARCA","CELENDIN","SUCRE"]
[null,"060311","CAJAMARCA","CELENDIN","UTCO"]
[null,"060312","CAJAMARCA","CELENDIN","LA LIBERTAD DE PALLAN"]
[null,"060401","CAJAMARCA","CHOTA","CHOTA"]
[null,"060402","CAJAMARCA","CHOTA","ANGUIA"]
[null,"060403","CAJAMARCA","CHOTA","CHADIN"]
[null,"060404","CAJAMARCA","CHOTA","CHIGUIRIP"]
[null,"060405","CAJAMARCA","CHOTA","CHIMBAN"]
[null,"060406","CAJAMARCA","CHOTA","CHOROPAMPA"]
[null,"060407","CAJAMARCA","CHOTA","COCHABAMBA"]
[null,"060408","CAJAMARCA","CHOTA","CONCHAN"]
[null,"060409","CAJAMARCA","CHOTA","HUAMBOS"]
[null,"060410","CAJAMARCA","CHOTA","LAJAS"]
[null,"060411","CAJAMARCA","CHOTA","LLAMA"]
[null,"060412","CAJAMARCA","CHOTA","MIRACOSTA"]
[null,"060413","CAJAMARCA","CHOTA","PACCHA"]
[null,"060414","CAJAMARCA","CHOTA","PION"]
[null,"060415","CAJAMARCA","CHOTA","QUEROCOTO"]
[null,"060416","CAJAMARCA","CHOTA","SAN JUAN DE LICUPIS"]
[null,"060417","CAJAMARCA","CHOTA","TACABAMBA"]
[null,"060418","CAJAMARCA","CHOTA","TOCMOCHE"]
[null,"060419","CAJAMARCA","CHOTA","CHALAMARCA"]
[null,"060501","CAJAMARCA","CONTUMAZA","CONTUMAZA"]
[null,"060502","CAJAMARCA","CONTUMAZA","CHILETE"]
[null,"060503","CAJAMARCA","CONTUMAZA","CUPISNIQUE"]
[null,"060504","CAJAMARCA","CONTUMAZA","GUZMANGO"]
[null,"060505","CAJAMARCA","CONTUMAZA","SAN BENITO"]
[null,"060506","CAJAMARCA","CONTUMAZA","SANTA CRUZ DE TOLEDO"]
[null,"060507","CAJAMARCA","CONTUMAZA","TANTARICA"]
[null,"060508","CAJAMARCA","CONTUMAZA","YONAN"]
[null,"060601","CAJAMARCA","CUTERVO","CUTERVO"]
[null,"060602","CAJAMARCA","CUTERVO","CALLAYUC"]
[null,"060603","CAJAMARCA","CUTERVO","CHOROS"]
[null,"060604","CAJAMARCA","CUTERVO","CUJILLO"]
[null,"060605","CAJAMARCA","CUTERVO","LA RAMADA"]
[null,"060606","CAJAMARCA","CUTERVO","PIMPINGOS"]
[null,"060607","CAJAMARCA","CUTERVO","QUEROCOTILLO"]
[null,"060608","CAJAMARCA","CUTERVO","SAN ANDRES DE CUTERVO"]
[null,"060609","CAJAMARCA","CUTERVO","SAN JUAN DE CUTERVO"]
[null,"060610","CAJAMARCA","CUTERVO","SAN LUIS DE LUCMA"]
[null,"060611","CAJAMARCA","CUTERVO","SANTA CRUZ"]
[null,"060612","CAJAMARCA","CUTERVO","SANTO DOMINGO DE LA CAPILLA"]
[null,"060613","CAJAMARCA","CUTERVO","SANTO TOMAS"]
[null,"060614","CAJAMARCA","CUTERVO","SOCOTA"]
[null,"060615","CAJAMARCA","CUTERVO","TORIBIO CASANOVA"]
[null,"060701","CAJAMARCA","HUALGAYOC","BAMBAMARCA"]
[null,"060702","CAJAMARCA","HUALGAYOC","CHUGUR"]
[null,"060703","CAJAMARCA","HUALGAYOC","HUALGAYOC"]
[null,"060801","CAJAMARCA","JAEN","JAEN"]
[null,"060802","CAJAMARCA","JAEN","BELLAVISTA"]
[null,"060803","CAJAMARCA","JAEN","CHONTALI"]
[null,"060804","CAJAMARCA","JAEN","COLASAY"]
[null,"060805","CAJAMARCA","JAEN","HUABAL"]
[null,"060806","CAJAMARCA","JAEN","LAS PIRIAS"]
[null,"060807","CAJAMARCA","JAEN","POMAHUACA"]
[null,"060808","CAJAMARCA","JAEN","PUCARA"]
[null,"060809","CAJAMARCA","JAEN","SALLIQUE"]
[null,"060810","CAJAMARCA","JAEN","SAN FELIPE"]
[null,"060811","CAJAMARCA","JAEN","SAN JOSE DEL ALTO"]
[null,"060812","CAJAMARCA","JAEN","SANTA ROSA"]
[null,"060901","CAJAMARCA","SAN IGNACIO","SAN IGNACIO"]
[null,"060902","CAJAMARCA","SAN IGNACIO","CHIRINOS"]
[null,"060903","CAJAMARCA","SAN IGNACIO","HUARANGO"]
[null,"060904","CAJAMARCA","SAN IGNACIO","LA COIPA"]
[null,"060905","CAJAMARCA","SAN IGNACIO","NAMBALLE"]
[null,"060906","CAJAMARCA","SAN IGNACIO","SAN JOSE DE LOURDES"]
[null,"060907","CAJAMARCA","SAN IGNACIO","TABACONAS"]
[null,"061001","CAJAMARCA","SAN MARCOS","PEDRO GALVEZ"]
[null,"061002","CAJAMARCA","SAN MARCOS","CHANCAY"]
[null,"061003","CAJAMARCA","SAN MARCOS","EDUARDO VILLANUEVA"]
[null,"061004","CAJAMARCA","SAN MARCOS","GREGORIO PITA"]
[null,"061005","CAJAMARCA","SAN MARCOS","ICHOCAN"]
[null,"061006","CAJAMARCA","SAN MARCOS","JOSE MANUEL QUIROZ"]
[null,"061007","CAJAMARCA","SAN MARCOS","JOSE SABOGAL"]
[null,"061101","CAJAMARCA","SAN MIGUEL","SAN MIGUEL"]
[null,"061102","CAJAMARCA","SAN MIGUEL","BOLIVAR"]
[null,"061103","CAJAMARCA","SAN MIGUEL","CALQUIS"]
[null,"061104","CAJAMARCA","SAN MIGUEL","CATILLUC"]
[null,"061105","CAJAMARCA","SAN MIGUEL","EL PRADO"]
[null,"061106","CAJAMARCA","SAN MIGUEL","LA FLORIDA"]
[null,"061107","CAJAMARCA","SAN MIGUEL","LLAPA"]
[null,"061108","CAJAMARCA","SAN MIGUEL","NANCHOC"]
[null,"061109","CAJAMARCA","SAN MIGUEL","NIEPOS"]
[null,"061110","CAJAMARCA","SAN MIGUEL","SAN GREGORIO"]
[null,"061111","CAJAMARCA","SAN MIGUEL","SAN SILVESTRE DE COCHAN"]
[null,"061112","CAJAMARCA","SAN MIGUEL","TONGOD"]
[null,"061113","CAJAMARCA","SAN MIGUEL","UNION AGUA BLANCA"]
[null,"061201","CAJAMARCA","SAN PABLO","SAN PABLO"]
[null,"061202","CAJAMARCA","SAN PABLO","SAN BERNARDINO"]
[null,"061203","CAJAMARCA","SAN PABLO","SAN LUIS"]
[null,"061204","CAJAMARCA","SAN PABLO","TUMBADEN"]
[null,"061301","CAJAMARCA","SANTA CRUZ","SANTA CRUZ"]
[null,"061302","CAJAMARCA","SANTA CRUZ","ANDABAMBA"]
[null,"061303","CAJAMARCA","SANTA CRUZ","CATACHE"]
[null,"061304","CAJAMARCA","SANTA CRUZ","CHANCAYBAÑOS"]
[null,"061305","CAJAMARCA","SANTA CRUZ","LA ESPERANZA"]
[null,"061306","CAJAMARCA","SANTA CRUZ","NINABAMBA"]
[null,"061307","CAJAMARCA","SANTA CRUZ","PULAN"]
[null,"061308","CAJAMARCA","SANTA CRUZ","SAUCEPAMPA"]
[null,"061309","CAJAMARCA","SANTA CRUZ","SEXI"]
[null,"061310","CAJAMARCA","SANTA CRUZ","UTICYACU"]
[null,"061311","CAJAMARCA","SANTA CRUZ","YAUYUCAN"]
[null,"070101","CALLAO","CALLAO","CALLAO"]
[null,"070102","CALLAO","CALLAO","BELLAVISTA"]
[null,"070103","CALLAO","CALLAO","CARMEN DE LA LEGUA REYNOSO"]
[null,"070104","CALLAO","CALLAO","LA PERLA"]
[null,"070105","CALLAO","CALLAO","LA PUNTA"]
[null,"070106","CALLAO","CALLAO","VENTANILLA"]
[null,"070107","CALLAO","CALLAO","MI PERU"]
[null,"080101","CUSCO","CUSCO","CUSCO"]
[null,"080102","CUSCO","CUSCO","CCORCA"]
[null,"080103","CUSCO","CUSCO","POROY"]
[null,"080104","CUSCO","CUSCO","SAN JERONIMO"]
[null,"080105","CUSCO","CUSCO","SAN SEBASTIAN"]
[null,"080106","CUSCO","CUSCO","SANTIAGO"]
[null,"080107","CUSCO","CUSCO","SAYLLA"]
[null,"080108","CUSCO","CUSCO","WANCHAQ"]
[null,"080201","CUSCO","ACOMAYO","ACOMAYO"]
[null,"080202","CUSCO","ACOMAYO","ACOPIA"]
[null,"080203","CUSCO","ACOMAYO","ACOS"]
[null,"080204","CUSCO","ACOMAYO","MOSOC LLACTA"]
[null,"080205","CUSCO","ACOMAYO","POMACANCHI"]
[null,"080206","CUSCO","ACOMAYO","RONDOCAN"]
[null,"080207","CUSCO","ACOMAYO","SANGARARA"]
[null,"080301","CUSCO","ANTA","ANTA"]
[null,"080302","CUSCO","ANTA","ANCAHUASI"]
[null,"080303","CUSCO","ANTA","CACHIMAYO"]
[null,"080304","CUSCO","ANTA","CHINCHAYPUJIO"]
[null,"080305","CUSCO","ANTA","HUAROCONDO"]
[null,"080306","CUSCO","ANTA","LIMATAMBO"]
[null,"080307","CUSCO","ANTA","MOLLEPATA"]
[null,"080308","CUSCO","ANTA","PUCYURA"]
[null,"080309","CUSCO","ANTA","ZURITE"]
[null,"080401","CUSCO","CALCA","CALCA"]
[null,"080402","CUSCO","CALCA","COYA"]
[null,"080403","CUSCO","CALCA","LAMAY"]
[null,"080404","CUSCO","CALCA","LARES"]
[null,"080405","CUSCO","CALCA","PISAC"]
[null,"080406","CUSCO","CALCA","SAN SALVADOR"]
[null,"080407","CUSCO","CALCA","TARAY"]
[null,"080408","CUSCO","CALCA","YANATILE"]
[null,"080501","CUSCO","CANAS","YANAOCA"]
[null,"080502","CUSCO","CANAS","CHECCA"]
[null,"080503","CUSCO","CANAS","KUNTURKANKI"]
[null,"080504","CUSCO","CANAS","LANGUI"]
[null,"080505","CUSCO","CANAS","LAYO"]
[null,"080506","CUSCO","CANAS","PAMPAMARCA"]
[null,"080507","CUSCO","CANAS","QUEHUE"]
[null,"080508","CUSCO","CANAS","TUPAC AMARU"]
[null,"080601","CUSCO","CANCHIS","SICUANI"]
[null,"080602","CUSCO","CANCHIS","CHECACUPE"]
[null,"080603","CUSCO","CANCHIS","COMBAPATA"]
[null,"080604","CUSCO","CANCHIS","MARANGANI"]
[null,"080605","CUSCO","CANCHIS","PITUMARCA"]
[null,"080606","CUSCO","CANCHIS","SAN PABLO"]
[null,"080607","CUSCO","CANCHIS","SAN PEDRO"]
[null,"080608","CUSCO","CANCHIS","TINTA"]
[null,"080701","CUSCO","CHUMBIVILCAS","SANTO TOMAS"]
[null,"080702","CUSCO","CHUMBIVILCAS","CAPACMARCA"]
[null,"080703","CUSCO","CHUMBIVILCAS","CHAMACA"]
[null,"080704","CUSCO","CHUMBIVILCAS","COLQUEMARCA"]
[null,"080705","CUSCO","CHUMBIVILCAS","LIVITACA"]
[null,"080706","CUSCO","CHUMBIVILCAS","LLUSCO"]
[null,"080707","CUSCO","CHUMBIVILCAS","QUIÑOTA"]
[null,"080708","CUSCO","CHUMBIVILCAS","VELILLE"]
[null,"080801","CUSCO","ESPINAR","ESPINAR"]
[null,"080802","CUSCO","ESPINAR","CONDOROMA"]
[null,"080803","CUSCO","ESPINAR","COPORAQUE"]
[null,"080804","CUSCO","ESPINAR","OCORURO"]
[null,"080805","CUSCO","ESPINAR","PALLPATA"]
[null,"080806","CUSCO","ESPINAR","PICHIGUA"]
[null,"080807","CUSCO","ESPINAR","SUYCKUTAMBO"]
[null,"080808","CUSCO","ESPINAR","ALTO PICHIGUA"]
[null,"080901","CUSCO","LA CONVENCION","SANTA ANA"]
[null,"080902","CUSCO","LA CONVENCION","ECHARATE"]
[null,"080903","CUSCO","LA CONVENCION","HUAYOPATA"]
[null,"080904","CUSCO","LA CONVENCION","MARANURA"]
[null,"080905","CUSCO","LA CONVENCION","OCOBAMBA"]
[null,"080906","CUSCO","LA CONVENCION","QUELLOUNO"]
[null,"080907","CUSCO","LA CONVENCION","KIMBIRI"]
[null,"080908","CUSCO","LA CONVENCION","SANTA TERESA"]
[null,"080909","CUSCO","LA CONVENCION","VILCABAMBA"]
[null,"080910","CUSCO","LA CONVENCION","PICHARI"]
[null,"080911","CUSCO","LA CONVENCION","INKAWASI"]
[null,"080912","CUSCO","LA CONVENCION","VILLA VIRGEN"]
[null,"080913","CUSCO","LA CONVENCION","VILLA KINTIARINA"]
[null,"080914","CUSCO","LA CONVENCION","MEGANTONI"]
[null,"080915","CUSCO","LA CONVENCION","KUMPIRUSHIATO"]
[null,"080916","CUSCO","LA CONVENCION","CIELO PUNCO"]
[null,"080917","CUSCO","LA CONVENCION","MANITEA"]
[null,"080918","CUSCO","LA CONVENCION","UNION ASHANINKA"]
[null,"081001","CUSCO","PARURO","PARURO"]
[null,"081002","CUSCO","PARURO","ACCHA"]
[null,"081003","CUSCO","PARURO","CCAPI"]
[null,"081004","CUSCO","PARURO","COLCHA"]
[null,"081005","CUSCO","PARURO","HUANOQUITE"]
[null,"081006","CUSCO","PARURO","OMACHA"]
[null,"081007","CUSCO","PARURO","PACCARITAMBO"]
[null,"081008","CUSCO","PARURO","PILLPINTO"]
[null,"081009","CUSCO","PARURO","YAURISQUE"]
[null,"081101","CUSCO","PAUCARTAMBO","PAUCARTAMBO"]
[null,"081102","CUSCO","PAUCARTAMBO","CAICAY"]
[null,"081103","CUSCO","PAUCARTAMBO","CHALLABAMBA"]
[null,"081104","CUSCO","PAUCARTAMBO","COLQUEPATA"]
[null,"081105","CUSCO","PAUCARTAMBO","HUANCARANI"]
[null,"081106","CUSCO","PAUCARTAMBO","KOSÑIPATA"]
[null,"081201","CUSCO","QUISPICANCHI","URCOS"]
[null,"081202","CUSCO","QUISPICANCHI","ANDAHUAYLILLAS"]
[null,"081203","CUSCO","QUISPICANCHI","CAMANTI"]
[null,"081204","CUSCO","QUISPICANCHI","CCARHUAYO"]
[null,"081205","CUSCO","QUISPICANCHI","CCATCA"]
[null,"081206","CUSCO","QUISPICANCHI","CUSIPATA"]
[null,"081207","CUSCO","QUISPICANCHI","HUARO"]
[null,"081208","CUSCO","QUISPICANCHI","LUCRE"]
[null,"081209","CUSCO","QUISPICANCHI","MARCAPATA"]
[null,"081210","CUSCO","QUISPICANCHI","OCONGATE"]
[null,"081211","CUSCO","QUISPICANCHI","OROPESA"]
[null,"081212","CUSCO","QUISPICANCHI","QUIQUIJANA"]
[null,"081301","CUSCO","URUBAMBA","URUBAMBA"]
[null,"081302","CUSCO","URUBAMBA","CHINCHERO"]
[null,"081303","CUSCO","URUBAMBA","HUAYLLABAMBA"]
[null,"081304","CUSCO","URUBAMBA","MACHUPICCHU"]
[null,"081305","CUSCO","URUBAMBA","MARAS"]
[null,"081306","CUSCO","URUBAMBA","OLLANTAYTAMBO"]
[null,"081307","CUSCO","URUBAMBA","YUCAY"]
[null,"090101","HUANCAVELICA","HUANCAVELICA","HUANCAVELICA"]
[null,"090102","HUANCAVELICA","HUANCAVELICA","ACOBAMBILLA"]
[null,"090103","HUANCAVELICA","HUANCAVELICA","ACORIA"]
[null,"090104","HUANCAVELICA","HUANCAVELICA","CONAYCA"]
[null,"090105","HUANCAVELICA","HUANCAVELICA","CUENCA"]
[null,"090106","HUANCAVELICA","HUANCAVELICA","HUACHOCOLPA"]
[null,"090107","HUANCAVELICA","HUANCAVELICA","HUAYLLAHUARA"]
[null,"090108","HUANCAVELICA","HUANCAVELICA","IZCUCHACA"]
[null,"090109","HUANCAVELICA","HUANCAVELICA","LARIA"]
[null,"090110","HUANCAVELICA","HUANCAVELICA","MANTA"]
[null,"090111","HUANCAVELICA","HUANCAVELICA","MARISCAL CACERES"]
[null,"090112","HUANCAVELICA","HUANCAVELICA","MOYA"]
[null,"090113","HUANCAVELICA","HUANCAVELICA","NUEVO OCCORO"]
[null,"090114","HUANCAVELICA","HUANCAVELICA","PALCA"]
[null,"090115","HUANCAVELICA","HUANCAVELICA","PILCHACA"]
[null,"090116","HUANCAVELICA","HUANCAVELICA","VILCA"]
[null,"090117","HUANCAVELICA","HUANCAVELICA","YAULI"]
[null,"090118","HUANCAVELICA","HUANCAVELICA","ASCENSION"]
[null,"090119","HUANCAVELICA","HUANCAVELICA","HUANDO"]
[null,"090201","HUANCAVELICA","ACOBAMBA","ACOBAMBA"]
[null,"090202","HUANCAVELICA","ACOBAMBA","ANDABAMBA"]
[null,"090203","HUANCAVELICA","ACOBAMBA","ANTA"]
[null,"090204","HUANCAVELICA","ACOBAMBA","CAJA"]
[null,"090205","HUANCAVELICA","ACOBAMBA","MARCAS"]
[null,"090206","HUANCAVELICA","ACOBAMBA","PAUCARA"]
[null,"090207","HUANCAVELICA","ACOBAMBA","POMACOCHA"]
[null,"090208","HUANCAVELICA","ACOBAMBA","ROSARIO"]
[null,"090301","HUANCAVELICA","ANGARAES","LIRCAY"]
[null,"090302","HUANCAVELICA","ANGARAES","ANCHONGA"]
[null,"090303","HUANCAVELICA","ANGARAES","CALLANMARCA"]
[null,"090304","HUANCAVELICA","ANGARAES","CCOCHACCASA"]
[null,"090305","HUANCAVELICA","ANGARAES","CHINCHO"]
[null,"090306","HUANCAVELICA","ANGARAES","CONGALLA"]
[null,"090307","HUANCAVELICA","ANGARAES","HUANCA-HUANCA"]
[null,"090308","HUANCAVELICA","ANGARAES","HUAYLLAY GRANDE"]
[null,"090309","HUANCAVELICA","ANGARAES","JULCAMARCA"]
[null,"090310","HUANCAVELICA","ANGARAES","SAN ANTONIO DE ANTAPARCO"]
[null,"090311","HUANCAVELICA","ANGARAES","SANTO TOMAS DE PATA"]
[null,"090312","HUANCAVELICA","ANGARAES","SECCLLA"]
[null,"090401","HUANCAVELICA","CASTROVIRREYNA","CASTROVIRREYNA"]
[null,"090402","HUANCAVELICA","CASTROVIRREYNA","ARMA"]
[null,"090403","HUANCAVELICA","CASTROVIRREYNA","AURAHUA"]
[null,"090404","HUANCAVELICA","CASTROVIRREYNA","CAPILLAS"]
[null,"090405","HUANCAVELICA","CASTROVIRREYNA","CHUPAMARCA"]
[null,"090406","HUANCAVELICA","CASTROVIRREYNA","COCAS"]
[null,"090407","HUANCAVELICA","CASTROVIRREYNA","HUACHOS"]
[null,"090408","HUANCAVELICA","CASTROVIRREYNA","HUAMATAMBO"]
[null,"090409","HUANCAVELICA","CASTROVIRREYNA","MOLLEPAMPA"]
[null,"090410","HUANCAVELICA","CASTROVIRREYNA","SAN JUAN"]
[null,"090411","HUANCAVELICA","CASTROVIRREYNA","SANTA ANA"]
[null,"090412","HUANCAVELICA","CASTROVIRREYNA","TANTARA"]
[null,"090413","HUANCAVELICA","CASTROVIRREYNA","TICRAPO"]
[null,"090501","HUANCAVELICA","CHURCAMPA","CHURCAMPA"]
[null,"090502","HUANCAVELICA","CHURCAMPA","ANCO"]
[null,"090503","HUANCAVELICA","CHURCAMPA","CHINCHIHUASI"]
[null,"090504","HUANCAVELICA","CHURCAMPA","EL CARMEN"]
[null,"090505","HUANCAVELICA","CHURCAMPA","LA MERCED"]
[null,"090506","HUANCAVELICA","CHURCAMPA","LOCROJA"]
[null,"090507","HUANCAVELICA","CHURCAMPA","PAUCARBAMBA"]
[null,"090508","HUANCAVELICA","CHURCAMPA","SAN MIGUEL DE MAYOCC"]
[null,"090509","HUANCAVELICA","CHURCAMPA","SAN PEDRO DE CORIS"]
[null,"090510","HUANCAVELICA","CHURCAMPA","PACHAMARCA"]
[null,"090511","HUANCAVELICA","CHURCAMPA","COSME"]
[null,"090601","HUANCAVELICA","HUAYTARA","HUAYTARA"]
[null,"090602","HUANCAVELICA","HUAYTARA","AYAVI"]
[null,"090603","HUANCAVELICA","HUAYTARA","CORDOVA"]
[null,"090604","HUANCAVELICA","HUAYTARA","HUAYACUNDO ARMA"]
[null,"090605","HUANCAVELICA","HUAYTARA","LARAMARCA"]
[null,"090606","HUANCAVELICA","HUAYTARA","OCOYO"]
[null,"090607","HUANCAVELICA","HUAYTARA","PILPICHACA"]
[null,"090608","HUANCAVELICA","HUAYTARA","QUERCO"]
[null,"090609","HUANCAVELICA","HUAYTARA","QUITO-ARMA"]
[null,"090610","HUANCAVELICA","HUAYTARA","SAN ANTONIO DE CUSICANCHA"]
[null,"090611","HUANCAVELICA","HUAYTARA","SAN FRANCISCO DE SANGAYAICO"]
[null,"090612","HUANCAVELICA","HUAYTARA","SAN ISIDRO"]
[null,"090613","HUANCAVELICA","HUAYTARA","SANTIAGO DE CHOCORVOS"]
[null,"090614","HUANCAVELICA","HUAYTARA","SANTIAGO DE QUIRAHUARA"]
[null,"090615","HUANCAVELICA","HUAYTARA","SANTO DOMINGO DE CAPILLAS"]
[null,"090616","HUANCAVELICA","HUAYTARA","TAMBO"]
[null,"090701","HUANCAVELICA","TAYACAJA","PAMPAS"]
[null,"090702","HUANCAVELICA","TAYACAJA","ACOSTAMBO"]
[null,"090703","HUANCAVELICA","TAYACAJA","ACRAQUIA"]
[null,"090704","HUANCAVELICA","TAYACAJA","AHUAYCHA"]
[null,"090705","HUANCAVELICA","TAYACAJA","COLCABAMBA"]
[null,"090706","HUANCAVELICA","TAYACAJA","DANIEL HERNANDEZ"]
[null,"090707","HUANCAVELICA","TAYACAJA","HUACHOCOLPA"]
[null,"090709","HUANCAVELICA","TAYACAJA","HUARIBAMBA"]
[null,"090710","HUANCAVELICA","TAYACAJA","ÑAHUIMPUQUIO"]
[null,"090711","HUANCAVELICA","TAYACAJA","PAZOS"]
[null,"090713","HUANCAVELICA","TAYACAJA","QUISHUAR"]
[null,"090714","HUANCAVELICA","TAYACAJA","SALCABAMBA"]
[null,"090715","HUANCAVELICA","TAYACAJA","SALCAHUASI"]
[null,"090716","HUANCAVELICA","TAYACAJA","SAN MARCOS DE ROCCHAC"]
[null,"090717","HUANCAVELICA","TAYACAJA","SURCUBAMBA"]
[null,"090718","HUANCAVELICA","TAYACAJA","TINTAY PUNCU"]
[null,"090719","HUANCAVELICA","TAYACAJA","QUICHUAS"]
[null,"090720","HUANCAVELICA","TAYACAJA","ANDAYMARCA"]
[null,"090721","HUANCAVELICA","TAYACAJA","ROBLE"]
[null,"090722","HUANCAVELICA","TAYACAJA","PICHOS"]
[null,"090723","HUANCAVELICA","TAYACAJA","SANTIAGO DE TUCUMA"]
[null,"090724","HUANCAVELICA","TAYACAJA","LAMBRAS"]
[null,"090725","HUANCAVELICA","TAYACAJA","COCHABAMBA"]
[null,"100101","HUANUCO","HUANUCO","HUANUCO"]
[null,"100102","HUANUCO","HUANUCO","AMARILIS"]
[null,"100103","HUANUCO","HUANUCO","CHINCHAO"]
[null,"100104","HUANUCO","HUANUCO","CHURUBAMBA"]
[null,"100105","HUANUCO","HUANUCO","MARGOS"]
[null,"100106","HUANUCO","HUANUCO","QUISQUI (KICHKI)"]
[null,"100107","HUANUCO","HUANUCO","SAN FRANCISCO DE CAYRAN"]
[null,"100108","HUANUCO","HUANUCO","SAN PEDRO DE CHAULAN"]
[null,"100109","HUANUCO","HUANUCO","SANTA MARIA DEL VALLE"]
[null,"100110","HUANUCO","HUANUCO","YARUMAYO"]
[null,"100111","HUANUCO","HUANUCO","PILLCO MARCA"]
[null,"100112","HUANUCO","HUANUCO","YACUS"]
[null,"100113","HUANUCO","HUANUCO","SAN PABLO DE PILLAO"]
[null,"100201","HUANUCO","AMBO","AMBO"]
[null,"100202","HUANUCO","AMBO","CAYNA"]
[null,"100203","HUANUCO","AMBO","COLPAS"]
[null,"100204","HUANUCO","AMBO","CONCHAMARCA"]
[null,"100205","HUANUCO","AMBO","HUACAR"]
[null,"100206","HUANUCO","AMBO","SAN FRANCISCO"]
[null,"100207","HUANUCO","AMBO","SAN RAFAEL"]
[null,"100208","HUANUCO","AMBO","TOMAY KICHWA"]
[null,"100301","HUANUCO","DOS DE MAYO","LA UNION"]
[null,"100307","HUANUCO","DOS DE MAYO","CHUQUIS"]
[null,"100311","HUANUCO","DOS DE MAYO","MARIAS"]
[null,"100313","HUANUCO","DOS DE MAYO","PACHAS"]
[null,"100316","HUANUCO","DOS DE MAYO","QUIVILLA"]
[null,"100317","HUANUCO","DOS DE MAYO","RIPAN"]
[null,"100321","HUANUCO","DOS DE MAYO","SHUNQUI"]
[null,"100322","HUANUCO","DOS DE MAYO","SILLAPATA"]
[null,"100323","HUANUCO","DOS DE MAYO","YANAS"]
[null,"100401","HUANUCO","HUACAYBAMBA","HUACAYBAMBA"]
[null,"100402","HUANUCO","HUACAYBAMBA","CANCHABAMBA"]
[null,"100403","HUANUCO","HUACAYBAMBA","COCHABAMBA"]
[null,"100404","HUANUCO","HUACAYBAMBA","PINRA"]
[null,"100501","HUANUCO","HUAMALIES","LLATA"]
[null,"100502","HUANUCO","HUAMALIES","ARANCAY"]
[null,"100503","HUANUCO","HUAMALIES","CHAVIN DE PARIARCA"]
[null,"100504","HUANUCO","HUAMALIES","JACAS GRANDE"]
[null,"100505","HUANUCO","HUAMALIES","JIRCAN"]
[null,"100506","HUANUCO","HUAMALIES","MIRAFLORES"]
[null,"100507","HUANUCO","HUAMALIES","MONZON"]
[null,"100508","HUANUCO","HUAMALIES","PUNCHAO"]
[null,"100509","HUANUCO","HUAMALIES","PUÑOS"]
[null,"100510","HUANUCO","HUAMALIES","SINGA"]
[null,"100511","HUANUCO","HUAMALIES","TANTAMAYO"]
[null,"100601","HUANUCO","LEONCIO PRADO","RUPA-RUPA"]
[null,"100602","HUANUCO","LEONCIO PRADO","DANIEL ALOMIA ROBLES"]
[null,"100603","HUANUCO","LEONCIO PRADO","HERMILIO VALDIZAN"]
[null,"100604","HUANUCO","LEONCIO PRADO","JOSE CRESPO Y CASTILLO"]
[null,"100605","HUANUCO","LEONCIO PRADO","LUYANDO"]
[null,"100606","HUANUCO","LEONCIO PRADO","MARIANO DAMASO BERAUN"]
[null,"100607","HUANUCO","LEONCIO PRADO","PUCAYACU"]
[null,"100608","HUANUCO","LEONCIO PRADO","CASTILLO GRANDE"]
[null,"100609","HUANUCO","LEONCIO PRADO","PUEBLO NUEVO"]
[null,"100610","HUANUCO","LEONCIO PRADO","SANTO DOMINGO DE ANDA"]
[null,"100701","HUANUCO","MARAÑON","HUACRACHUCO"]
[null,"100702","HUANUCO","MARAÑON","CHOLON"]
[null,"100703","HUANUCO","MARAÑON","SAN BUENAVENTURA"]
[null,"100704","HUANUCO","MARAÑON","LA MORADA"]
[null,"100705","HUANUCO","MARAÑON","SANTA ROSA DE ALTO YANAJANCA"]
[null,"100801","HUANUCO","PACHITEA","PANAO"]
[null,"100802","HUANUCO","PACHITEA","CHAGLLA"]
[null,"100803","HUANUCO","PACHITEA","MOLINO"]
[null,"100804","HUANUCO","PACHITEA","UMARI"]
[null,"100901","HUANUCO","PUERTO INCA","PUERTO INCA"]
[null,"100902","HUANUCO","PUERTO INCA","CODO DEL POZUZO"]
[null,"100903","HUANUCO","PUERTO INCA","HONORIA"]
[null,"100904","HUANUCO","PUERTO INCA","TOURNAVISTA"]
[null,"100905","HUANUCO","PUERTO INCA","YUYAPICHIS"]
[null,"101001","HUANUCO","LAURICOCHA","JESUS"]
[null,"101002","HUANUCO","LAURICOCHA","BAÑOS"]
[null,"101003","HUANUCO","LAURICOCHA","JIVIA"]
[null,"101004","HUANUCO","LAURICOCHA","QUEROPALCA"]
[null,"101005","HUANUCO","LAURICOCHA","RONDOS"]
[null,"101006","HUANUCO","LAURICOCHA","SAN FRANCISCO DE ASIS"]
[null,"101007","HUANUCO","LAURICOCHA","SAN MIGUEL DE CAURI"]
[null,"101101","HUANUCO","YAROWILCA","CHAVINILLO"]
[null,"101102","HUANUCO","YAROWILCA","CAHUAC"]
[null,"101103","HUANUCO","YAROWILCA","CHACABAMBA"]
[null,"101104","HUANUCO","YAROWILCA","APARICIO POMARES"]
[null,"101105","HUANUCO","YAROWILCA","JACAS CHICO"]
[null,"101106","HUANUCO","YAROWILCA","OBAS"]
[null,"101107","HUANUCO","YAROWILCA","PAMPAMARCA"]
[null,"101108","HUANUCO","YAROWILCA","CHORAS"]
[null,"110101","ICA","ICA","ICA"]
[null,"110102","ICA","ICA","LA TINGUIÑA"]
[null,"110103","ICA","ICA","LOS AQUIJES"]
[null,"110104","ICA","ICA","OCUCAJE"]
[null,"110105","ICA","ICA","PACHACUTEC"]
[null,"110106","ICA","ICA","PARCONA"]
[null,"110107","ICA","ICA","PUEBLO NUEVO"]
[null,"110108","ICA","ICA","SALAS"]
[null,"110109","ICA","ICA","SAN JOSE DE LOS MOLINOS"]
[null,"110110","ICA","ICA","SAN JUAN BAUTISTA"]
[null,"110111","ICA","ICA","SANTIAGO"]
[null,"110112","ICA","ICA","SUBTANJALLA"]
[null,"110113","ICA","ICA","TATE"]
[null,"110114","ICA","ICA","YAUCA DEL ROSARIO"]
[null,"110201","ICA","CHINCHA","CHINCHA ALTA"]
[null,"110202","ICA","CHINCHA","ALTO LARAN"]
[null,"110203","ICA","CHINCHA","CHAVIN"]
[null,"110204","ICA","CHINCHA","CHINCHA BAJA"]
[null,"110205","ICA","CHINCHA","EL CARMEN"]
[null,"110206","ICA","CHINCHA","GROCIO PRADO"]
[null,"110207","ICA","CHINCHA","PUEBLO NUEVO"]
[null,"110208","ICA","CHINCHA","SAN JUAN DE YANAC"]
[null,"110209","ICA","CHINCHA","SAN PEDRO DE HUACARPANA"]
[null,"110210","ICA","CHINCHA","SUNAMPE"]
[null,"110211","ICA","CHINCHA","TAMBO DE MORA"]
[null,"110301","ICA","NASCA","NASCA"]
[null,"110302","ICA","NASCA","CHANGUILLO"]
[null,"110303","ICA","NASCA","EL INGENIO"]
[null,"110304","ICA","NASCA","MARCONA"]
[null,"110305","ICA","NASCA","VISTA ALEGRE"]
[null,"110401","ICA","PALPA","PALPA"]
[null,"110402","ICA","PALPA","LLIPATA"]
[null,"110403","ICA","PALPA","RIO GRANDE"]
[null,"110404","ICA","PALPA","SANTA CRUZ"]
[null,"110405","ICA","PALPA","TIBILLO"]
[null,"110501","ICA","PISCO","PISCO"]
[null,"110502","ICA","PISCO","HUANCANO"]
[null,"110503","ICA","PISCO","HUMAY"]
[null,"110504","ICA","PISCO","INDEPENDENCIA"]
[null,"110505","ICA","PISCO","PARACAS"]
[null,"110506","ICA","PISCO","SAN ANDRES"]
[null,"110507","ICA","PISCO","SAN CLEMENTE"]
[null,"110508","ICA","PISCO","TUPAC AMARU INCA"]
[null,"120101","JUNIN","HUANCAYO","HUANCAYO"]
[null,"120104","JUNIN","HUANCAYO","CARHUACALLANGA"]
[null,"120105","JUNIN","HUANCAYO","CHACAPAMPA"]
[null,"120106","JUNIN","HUANCAYO","CHICCHE"]
[null,"120107","JUNIN","HUANCAYO","CHILCA"]
[null,"120108","JUNIN","HUANCAYO","CHONGOS ALTO"]
[null,"120111","JUNIN","HUANCAYO","CHUPURO"]
[null,"120112","JUNIN","HUANCAYO","COLCA"]
[null,"120113","JUNIN","HUANCAYO","CULLHUAS"]
[null,"120114","JUNIN","HUANCAYO","EL TAMBO"]
[null,"120116","JUNIN","HUANCAYO","HUACRAPUQUIO"]
[null,"120117","JUNIN","HUANCAYO","HUALHUAS"]
[null,"120119","JUNIN","HUANCAYO","HUANCAN"]
[null,"120120","JUNIN","HUANCAYO","HUASICANCHA"]
[null,"120121","JUNIN","HUANCAYO","HUAYUCACHI"]
[null,"120122","JUNIN","HUANCAYO","INGENIO"]
[null,"120124","JUNIN","HUANCAYO","PARIAHUANCA"]
[null,"120125","JUNIN","HUANCAYO","PILCOMAYO"]
[null,"120126","JUNIN","HUANCAYO","PUCARA"]
[null,"120127","JUNIN","HUANCAYO","QUICHUAY"]
[null,"120128","JUNIN","HUANCAYO","QUILCAS"]
[null,"120129","JUNIN","HUANCAYO","SAN AGUSTIN"]
[null,"120130","JUNIN","HUANCAYO","SAN JERONIMO DE TUNAN"]
[null,"120132","JUNIN","HUANCAYO","SAÑO"]
[null,"120133","JUNIN","HUANCAYO","SAPALLANGA"]
[null,"120134","JUNIN","HUANCAYO","SICAYA"]
[null,"120135","JUNIN","HUANCAYO","SANTO DOMINGO DE ACOBAMBA"]
[null,"120136","JUNIN","HUANCAYO","VIQUES"]
[null,"120201","JUNIN","CONCEPCION","CONCEPCION"]
[null,"120202","JUNIN","CONCEPCION","ACO"]
[null,"120203","JUNIN","CONCEPCION","ANDAMARCA"]
[null,"120204","JUNIN","CONCEPCION","CHAMBARA"]
[null,"120205","JUNIN","CONCEPCION","COCHAS"]
[null,"120206","JUNIN","CONCEPCION","COMAS"]
[null,"120207","JUNIN","CONCEPCION","HEROINAS TOLEDO"]
[null,"120208","JUNIN","CONCEPCION","MANZANARES"]
[null,"120209","JUNIN","CONCEPCION","MARISCAL CASTILLA"]
[null,"120210","JUNIN","CONCEPCION","MATAHUASI"]
[null,"120211","JUNIN","CONCEPCION","MITO"]
[null,"120212","JUNIN","CONCEPCION","NUEVE DE JULIO"]
[null,"120213","JUNIN","CONCEPCION","ORCOTUNA"]
[null,"120214","JUNIN","CONCEPCION","SAN JOSE DE QUERO"]
[null,"120215","JUNIN","CONCEPCION","SANTA ROSA DE OCOPA"]
[null,"120301","JUNIN","CHANCHAMAYO","CHANCHAMAYO"]
[null,"120302","JUNIN","CHANCHAMAYO","PERENE"]
[null,"120303","JUNIN","CHANCHAMAYO","PICHANAQUI"]
[null,"120304","JUNIN","CHANCHAMAYO","SAN LUIS DE SHUARO"]
[null,"120305","JUNIN","CHANCHAMAYO","SAN RAMON"]
[null,"120306","JUNIN","CHANCHAMAYO","VITOC"]
[null,"120401","JUNIN","JAUJA","JAUJA"]
[null,"120402","JUNIN","JAUJA","ACOLLA"]
[null,"120403","JUNIN","JAUJA","APATA"]
[null,"120404","JUNIN","JAUJA","ATAURA"]
[null,"120405","JUNIN","JAUJA","CANCHAYLLO"]
[null,"120406","JUNIN","JAUJA","CURICACA"]
[null,"120407","JUNIN","JAUJA","EL MANTARO"]
[null,"120408","JUNIN","JAUJA","HUAMALI"]
[null,"120409","JUNIN","JAUJA","HUARIPAMPA"]
[null,"120410","JUNIN","JAUJA","HUERTAS"]
[null,"120411","JUNIN","JAUJA","JANJAILLO"]
[null,"120412","JUNIN","JAUJA","JULCAN"]
[null,"120413","JUNIN","JAUJA","LEONOR ORDOÑEZ"]
[null,"120414","JUNIN","JAUJA","LLOCLLAPAMPA"]
[null,"120415","JUNIN","JAUJA","MARCO"]
[null,"120416","JUNIN","JAUJA","MASMA"]
[null,"120417","JUNIN","JAUJA","MASMA CHICCHE"]
[null,"120418","JUNIN","JAUJA","MOLINOS"]
[null,"120419","JUNIN","JAUJA","MONOBAMBA"]
[null,"120420","JUNIN","JAUJA","MUQUI"]
[null,"120421","JUNIN","JAUJA","MUQUIYAUYO"]
[null,"120422","JUNIN","JAUJA","PACA"]
[null,"120423","JUNIN","JAUJA","PACCHA"]
[null,"120424","JUNIN","JAUJA","PANCAN"]
[null,"120425","JUNIN","JAUJA","PARCO"]
[null,"120426","JUNIN","JAUJA","POMACANCHA"]
[null,"120427","JUNIN","JAUJA","RICRAN"]
[null,"120428","JUNIN","JAUJA","SAN LORENZO"]
[null,"120429","JUNIN","JAUJA","SAN PEDRO DE CHUNAN"]
[null,"120430","JUNIN","JAUJA","SAUSA"]
[null,"120431","JUNIN","JAUJA","SINCOS"]
[null,"120432","JUNIN","JAUJA","TUNAN MARCA"]
[null,"120433","JUNIN","JAUJA","YAULI"]
[null,"120434","JUNIN","JAUJA","YAUYOS"]
[null,"120501","JUNIN","JUNIN","JUNIN"]
[null,"120502","JUNIN","JUNIN","CARHUAMAYO"]
[null,"120503","JUNIN","JUNIN","ONDORES"]
[null,"120504","JUNIN","JUNIN","ULCUMAYO"]
[null,"120601","JUNIN","SATIPO","SATIPO"]
[null,"120602","JUNIN","SATIPO","COVIRIALI"]
[null,"120603","JUNIN","SATIPO","LLAYLLA"]
[null,"120604","JUNIN","SATIPO","MAZAMARI"]
[null,"120605","JUNIN","SATIPO","PAMPA HERMOSA"]
[null,"120606","JUNIN","SATIPO","PANGOA"]
[null,"120607","JUNIN","SATIPO","RIO NEGRO"]
[null,"120608","JUNIN","SATIPO","RIO TAMBO"]
[null,"120609","JUNIN","SATIPO","VIZCATAN DEL ENE"]
[null,"120701","JUNIN","TARMA","TARMA"]
[null,"120702","JUNIN","TARMA","ACOBAMBA"]
[null,"120703","JUNIN","TARMA","HUARICOLCA"]
[null,"120704","JUNIN","TARMA","HUASAHUASI"]
[null,"120705","JUNIN","TARMA","LA UNION"]
[null,"120706","JUNIN","TARMA","PALCA"]
[null,"120707","JUNIN","TARMA","PALCAMAYO"]
[null,"120708","JUNIN","TARMA","SAN PEDRO DE CAJAS"]
[null,"120709","JUNIN","TARMA","TAPO"]
[null,"120801","JUNIN","YAULI","LA OROYA"]
[null,"120802","JUNIN","YAULI","CHACAPALPA"]
[null,"120803","JUNIN","YAULI","HUAY-HUAY"]
[null,"120804","JUNIN","YAULI","MARCAPOMACOCHA"]
[null,"120805","JUNIN","YAULI","MOROCOCHA"]
[null,"120806","JUNIN","YAULI","PACCHA"]
[null,"120807","JUNIN","YAULI","SANTA BARBARA DE CARHUACAYAN"]
[null,"120808","JUNIN","YAULI","SANTA ROSA DE SACCO"]
[null,"120809","JUNIN","YAULI","SUITUCANCHA"]
[null,"120810","JUNIN","YAULI","YAULI"]
[null,"120901","JUNIN","CHUPACA","CHUPACA"]
[null,"120902","JUNIN","CHUPACA","AHUAC"]
[null,"120903","JUNIN","CHUPACA","CHONGOS BAJO"]
[null,"120904","JUNIN","CHUPACA","HUACHAC"]
[null,"120905","JUNIN","CHUPACA","HUAMANCACA CHICO"]
[null,"120906","JUNIN","CHUPACA","SAN JUAN DE ISCOS"]
[null,"120907","JUNIN","CHUPACA","SAN JUAN DE JARPA"]
[null,"120908","JUNIN","CHUPACA","TRES DE DICIEMBRE"]
[null,"120909","JUNIN","CHUPACA","YANACANCHA"]
[null,"130101","LA LIBERTAD","TRUJILLO","TRUJILLO"]
[null,"130102","LA LIBERTAD","TRUJILLO","EL PORVENIR"]
[null,"130103","LA LIBERTAD","TRUJILLO","FLORENCIA DE MORA"]
[null,"130104","LA LIBERTAD","TRUJILLO","HUANCHACO"]
[null,"130105","LA LIBERTAD","TRUJILLO","LA ESPERANZA"]
[null,"130106","LA LIBERTAD","TRUJILLO","LAREDO"]
[null,"130107","LA LIBERTAD","TRUJILLO","MOCHE"]
[null,"130108","LA LIBERTAD","TRUJILLO","POROTO"]
[null,"130109","LA LIBERTAD","TRUJILLO","SALAVERRY"]
[null,"130110","LA LIBERTAD","TRUJILLO","SIMBAL"]
[null,"130111","LA LIBERTAD","TRUJILLO","VICTOR LARCO HERRERA"]
[null,"130112","LA LIBERTAD","TRUJILLO","ALTO TRUJILLO"]
[null,"130201","LA LIBERTAD","ASCOPE","ASCOPE"]
[null,"130202","LA LIBERTAD","ASCOPE","CHICAMA"]
[null,"130203","LA LIBERTAD","ASCOPE","CHOCOPE"]
[null,"130204","LA LIBERTAD","ASCOPE","MAGDALENA DE CAO"]
[null,"130205","LA LIBERTAD","ASCOPE","PAIJAN"]
[null,"130206","LA LIBERTAD","ASCOPE","RAZURI"]
[null,"130207","LA LIBERTAD","ASCOPE","SANTIAGO DE CAO"]
[null,"130208","LA LIBERTAD","ASCOPE","CASA GRANDE"]
[null,"130301","LA LIBERTAD","BOLIVAR","BOLIVAR"]
[null,"130302","LA LIBERTAD","BOLIVAR","BAMBAMARCA"]
[null,"130303","LA LIBERTAD","BOLIVAR","CONDORMARCA"]
[null,"130304","LA LIBERTAD","BOLIVAR","LONGOTEA"]
[null,"130305","LA LIBERTAD","BOLIVAR","UCHUMARCA"]
[null,"130306","LA LIBERTAD","BOLIVAR","UCUNCHA"]
[null,"130401","LA LIBERTAD","CHEPEN","CHEPEN"]
[null,"130402","LA LIBERTAD","CHEPEN","PACANGA"]
[null,"130403","LA LIBERTAD","CHEPEN","PUEBLO NUEVO"]
[null,"130501","LA LIBERTAD","JULCAN","JULCAN"]
[null,"130502","LA LIBERTAD","JULCAN","CALAMARCA"]
[null,"130503","LA LIBERTAD","JULCAN","CARABAMBA"]
[null,"130504","LA LIBERTAD","JULCAN","HUASO"]
[null,"130601","LA LIBERTAD","OTUZCO","OTUZCO"]
[null,"130602","LA LIBERTAD","OTUZCO","AGALLPAMPA"]
[null,"130604","LA LIBERTAD","OTUZCO","CHARAT"]
[null,"130605","LA LIBERTAD","OTUZCO","HUARANCHAL"]
[null,"130606","LA LIBERTAD","OTUZCO","LA CUESTA"]
[null,"130608","LA LIBERTAD","OTUZCO","MACHE"]
[null,"130610","LA LIBERTAD","OTUZCO","PARANDAY"]
[null,"130611","LA LIBERTAD","OTUZCO","SALPO"]
[null,"130613","LA LIBERTAD","OTUZCO","SINSICAP"]
[null,"130614","LA LIBERTAD","OTUZCO","USQUIL"]
[null,"130701","LA LIBERTAD","PACASMAYO","SAN PEDRO DE LLOC"]
[null,"130702","LA LIBERTAD","PACASMAYO","GUADALUPE"]
[null,"130703","LA LIBERTAD","PACASMAYO","JEQUETEPEQUE"]
[null,"130704","LA LIBERTAD","PACASMAYO","PACASMAYO"]
[null,"130705","LA LIBERTAD","PACASMAYO","SAN JOSE"]
[null,"130801","LA LIBERTAD","PATAZ","TAYABAMBA"]
[null,"130802","LA LIBERTAD","PATAZ","BULDIBUYO"]
[null,"130803","LA LIBERTAD","PATAZ","CHILLIA"]
[null,"130804","LA LIBERTAD","PATAZ","HUANCASPATA"]
[null,"130805","LA LIBERTAD","PATAZ","HUAYLILLAS"]
[null,"130806","LA LIBERTAD","PATAZ","HUAYO"]
[null,"130807","LA LIBERTAD","PATAZ","ONGON"]
[null,"130808","LA LIBERTAD","PATAZ","PARCOY"]
[null,"130809","LA LIBERTAD","PATAZ","PATAZ"]
[null,"130810","LA LIBERTAD","PATAZ","PIAS"]
[null,"130811","LA LIBERTAD","PATAZ","SANTIAGO DE CHALLAS"]
[null,"130812","LA LIBERTAD","PATAZ","TAURIJA"]
[null,"130813","LA LIBERTAD","PATAZ","URPAY"]
[null,"130901","LA LIBERTAD","SANCHEZ CARRION","HUAMACHUCO"]
[null,"130902","LA LIBERTAD","SANCHEZ CARRION","CHUGAY"]
[null,"130903","LA LIBERTAD","SANCHEZ CARRION","COCHORCO"]
[null,"130904","LA LIBERTAD","SANCHEZ CARRION","CURGOS"]
[null,"130905","LA LIBERTAD","SANCHEZ CARRION","MARCABAL"]
[null,"130906","LA LIBERTAD","SANCHEZ CARRION","SANAGORAN"]
[null,"130907","LA LIBERTAD","SANCHEZ CARRION","SARIN"]
[null,"130908","LA LIBERTAD","SANCHEZ CARRION","SARTIMBAMBA"]
[null,"131001","LA LIBERTAD","SANTIAGO DE CHUCO","SANTIAGO DE CHUCO"]
[null,"131002","LA LIBERTAD","SANTIAGO DE CHUCO","ANGASMARCA"]
[null,"131003","LA LIBERTAD","SANTIAGO DE CHUCO","CACHICADAN"]
[null,"131004","LA LIBERTAD","SANTIAGO DE CHUCO","MOLLEBAMBA"]
[null,"131005","LA LIBERTAD","SANTIAGO DE CHUCO","MOLLEPATA"]
[null,"131006","LA LIBERTAD","SANTIAGO DE CHUCO","QUIRUVILCA"]
[null,"131007","LA LIBERTAD","SANTIAGO DE CHUCO","SANTA CRUZ DE CHUCA"]
[null,"131008","LA LIBERTAD","SANTIAGO DE CHUCO","SITABAMBA"]
[null,"131101","LA LIBERTAD","GRAN CHIMU","CASCAS"]
[null,"131102","LA LIBERTAD","GRAN CHIMU","LUCMA"]
[null,"131103","LA LIBERTAD","GRAN CHIMU","MARMOT"]
[null,"131104","LA LIBERTAD","GRAN CHIMU","SAYAPULLO"]
[null,"131201","LA LIBERTAD","VIRU","VIRU"]
[null,"131202","LA LIBERTAD","VIRU","CHAO"]
[null,"131203","LA LIBERTAD","VIRU","GUADALUPITO"]
[null,"140101","LAMBAYEQUE","CHICLAYO","CHICLAYO"]
[null,"140102","LAMBAYEQUE","CHICLAYO","CHONGOYAPE"]
[null,"140103","LAMBAYEQUE","CHICLAYO","ETEN"]
[null,"140104","LAMBAYEQUE","CHICLAYO","ETEN PUERTO"]
[null,"140105","LAMBAYEQUE","CHICLAYO","JOSE LEONARDO ORTIZ"]
[null,"140106","LAMBAYEQUE","CHICLAYO","LA VICTORIA"]
[null,"140107","LAMBAYEQUE","CHICLAYO","LAGUNAS"]
[null,"140108","LAMBAYEQUE","CHICLAYO","MONSEFU"]
[null,"140109","LAMBAYEQUE","CHICLAYO","NUEVA ARICA"]
[null,"140110","LAMBAYEQUE","CHICLAYO","OYOTUN"]
[null,"140111","LAMBAYEQUE","CHICLAYO","PICSI"]
[null,"140112","LAMBAYEQUE","CHICLAYO","PIMENTEL"]
[null,"140113","LAMBAYEQUE","CHICLAYO","REQUE"]
[null,"140114","LAMBAYEQUE","CHICLAYO","SANTA ROSA"]
[null,"140115","LAMBAYEQUE","CHICLAYO","SAÑA"]
[null,"140116","LAMBAYEQUE","CHICLAYO","CAYALTI"]
[null,"140117","LAMBAYEQUE","CHICLAYO","PATAPO"]
[null,"140118","LAMBAYEQUE","CHICLAYO","POMALCA"]
[null,"140119","LAMBAYEQUE","CHICLAYO","PUCALA"]
[null,"140120","LAMBAYEQUE","CHICLAYO","TUMAN"]
[null,"140201","LAMBAYEQUE","FERREÑAFE","FERREÑAFE"]
[null,"140202","LAMBAYEQUE","FERREÑAFE","CAÑARIS"]
[null,"140203","LAMBAYEQUE","FERREÑAFE","INCAHUASI"]
[null,"140204","LAMBAYEQUE","FERREÑAFE","MANUEL ANTONIO MESONES MURO"]
[null,"140205","LAMBAYEQUE","FERREÑAFE","PITIPO"]
[null,"140206","LAMBAYEQUE","FERREÑAFE","PUEBLO NUEVO"]
[null,"140301","LAMBAYEQUE","LAMBAYEQUE","LAMBAYEQUE"]
[null,"140302","LAMBAYEQUE","LAMBAYEQUE","CHOCHOPE"]
[null,"140303","LAMBAYEQUE","LAMBAYEQUE","ILLIMO"]
[null,"140304","LAMBAYEQUE","LAMBAYEQUE","JAYANCA"]
[null,"140305","LAMBAYEQUE","LAMBAYEQUE","MOCHUMI"]
[null,"140306","LAMBAYEQUE","LAMBAYEQUE","MORROPE"]
[null,"140307","LAMBAYEQUE","LAMBAYEQUE","MOTUPE"]
[null,"140308","LAMBAYEQUE","LAMBAYEQUE","OLMOS"]
[null,"140309","LAMBAYEQUE","LAMBAYEQUE","PACORA"]
[null,"140310","LAMBAYEQUE","LAMBAYEQUE","SALAS"]
[null,"140311","LAMBAYEQUE","LAMBAYEQUE","SAN JOSE"]
[null,"140312","LAMBAYEQUE","LAMBAYEQUE","TUCUME"]
[null,"150101","LIMA","LIMA","LIMA"]
[null,"150102","LIMA","LIMA","ANCON"]
[null,"150103","LIMA","LIMA","ATE"]
[null,"150104","LIMA","LIMA","BARRANCO"]
[null,"150105","LIMA","LIMA","BREÑA"]
[null,"150106","LIMA","LIMA","CARABAYLLO"]
[null,"150107","LIMA","LIMA","CHACLACAYO"]
[null,"150108","LIMA","LIMA","CHORRILLOS"]
[null,"150109","LIMA","LIMA","CIENEGUILLA"]
[null,"150110","LIMA","LIMA","COMAS"]
[null,"150111","LIMA","LIMA","EL AGUSTINO"]
[null,"150112","LIMA","LIMA","INDEPENDENCIA"]
[null,"150113","LIMA","LIMA","JESUS MARIA"]
[null,"150114","LIMA","LIMA","LA MOLINA"]
[null,"150115","LIMA","LIMA","LA VICTORIA"]
[null,"150116","LIMA","LIMA","LINCE"]
[null,"150117","LIMA","LIMA","LOS OLIVOS"]
[null,"150118","LIMA","LIMA","LURIGANCHO"]
[null,"150119","LIMA","LIMA","LURIN"]
[null,"150120","LIMA","LIMA","MAGDALENA DEL MAR"]
[null,"150121","LIMA","LIMA","PUEBLO LIBRE"]
[null,"150122","LIMA","LIMA","MIRAFLORES"]
[null,"150123","LIMA","LIMA","PACHACAMAC"]
[null,"150124","LIMA","LIMA","PUCUSANA"]
[null,"150125","LIMA","LIMA","PUENTE PIEDRA"]
[null,"150126","LIMA","LIMA","PUNTA HERMOSA"]
[null,"150127","LIMA","LIMA","PUNTA NEGRA"]
[null,"150128","LIMA","LIMA","RIMAC"]
[null,"150129","LIMA","LIMA","SAN BARTOLO"]
[null,"150130","LIMA","LIMA","SAN BORJA"]
[null,"150131","LIMA","LIMA","SAN ISIDRO"]
[null,"150132","LIMA","LIMA","SAN JUAN DE LURIGANCHO"]
[null,"150133","LIMA","LIMA","SAN JUAN DE MIRAFLORES"]
[null,"150134","LIMA","LIMA","SAN LUIS"]
[null,"150135","LIMA","LIMA","SAN MARTIN DE PORRES"]
[null,"150136","LIMA","LIMA","SAN MIGUEL"]
[null,"150137","LIMA","LIMA","SANTA ANITA"]
[null,"150138","LIMA","LIMA","SANTA MARIA DEL MAR"]
[null,"150139","LIMA","LIMA","SANTA ROSA"]
[null,"150140","LIMA","LIMA","SANTIAGO DE SURCO"]
[null,"150141","LIMA","LIMA","SURQUILLO"]
[null,"150142","LIMA","LIMA","VILLA EL SALVADOR"]
[null,"150143","LIMA","LIMA","VILLA MARIA DEL TRIUNFO"]
[null,"150201","LIMA","BARRANCA","BARRANCA"]
[null,"150202","LIMA","BARRANCA","PARAMONGA"]
[null,"150203","LIMA","BARRANCA","PATIVILCA"]
[null,"150204","LIMA","BARRANCA","SUPE"]
[null,"150205","LIMA","BARRANCA","SUPE PUERTO"]
[null,"150301","LIMA","CAJATAMBO","CAJATAMBO"]
[null,"150302","LIMA","CAJATAMBO","COPA"]
[null,"150303","LIMA","CAJATAMBO","GORGOR"]
[null,"150304","LIMA","CAJATAMBO","HUANCAPON"]
[null,"150305","LIMA","CAJATAMBO","MANAS"]
[null,"150401","LIMA","CANTA","CANTA"]
[null,"150402","LIMA","CANTA","ARAHUAY"]
[null,"150403","LIMA","CANTA","HUAMANTANGA"]
[null,"150404","LIMA","CANTA","HUAROS"]
[null,"150405","LIMA","CANTA","LACHAQUI"]
[null,"150406","LIMA","CANTA","SAN BUENAVENTURA"]
[null,"150407","LIMA","CANTA","SANTA ROSA DE QUIVES"]
[null,"150501","LIMA","CAÑETE","SAN VICENTE DE CAÑETE"]
[null,"150502","LIMA","CAÑETE","ASIA"]
[null,"150503","LIMA","CAÑETE","CALANGO"]
[null,"150504","LIMA","CAÑETE","CERRO AZUL"]
[null,"150505","LIMA","CAÑETE","CHILCA"]
[null,"150506","LIMA","CAÑETE","COAYLLO"]
[null,"150507","LIMA","CAÑETE","IMPERIAL"]
[null,"150508","LIMA","CAÑETE","LUNAHUANA"]
[null,"150509","LIMA","CAÑETE","MALA"]
[null,"150510","LIMA","CAÑETE","NUEVO IMPERIAL"]
[null,"150511","LIMA","CAÑETE","PACARAN"]
[null,"150512","LIMA","CAÑETE","QUILMANA"]
[null,"150513","LIMA","CAÑETE","SAN ANTONIO"]
[null,"150514","LIMA","CAÑETE","SAN LUIS"]
[null,"150515","LIMA","CAÑETE","SANTA CRUZ DE FLORES"]
[null,"150516","LIMA","CAÑETE","ZUÑIGA"]
[null,"150601","LIMA","HUARAL","HUARAL"]
[null,"150602","LIMA","HUARAL","ATAVILLOS ALTO"]
[null,"150603","LIMA","HUARAL","ATAVILLOS BAJO"]
[null,"150604","LIMA","HUARAL","AUCALLAMA"]
[null,"150605","LIMA","HUARAL","CHANCAY"]
[null,"150606","LIMA","HUARAL","IHUARI"]
[null,"150607","LIMA","HUARAL","LAMPIAN"]
[null,"150608","LIMA","HUARAL","PACARAOS"]
[null,"150609","LIMA","HUARAL","SAN MIGUEL DE ACOS"]
[null,"150610","LIMA","HUARAL","SANTA CRUZ DE ANDAMARCA"]
[null,"150611","LIMA","HUARAL","SUMBILCA"]
[null,"150612","LIMA","HUARAL","VEINTISIETE DE NOVIEMBRE"]
[null,"150701","LIMA","HUAROCHIRI","MATUCANA"]
[null,"150702","LIMA","HUAROCHIRI","ANTIOQUIA"]
[null,"150703","LIMA","HUAROCHIRI","CALLAHUANCA"]
[null,"150704","LIMA","HUAROCHIRI","CARAMPOMA"]
[null,"150705","LIMA","HUAROCHIRI","CHICLA"]
[null,"150706","LIMA","HUAROCHIRI","CUENCA"]
[null,"150707","LIMA","HUAROCHIRI","HUACHUPAMPA"]
[null,"150708","LIMA","HUAROCHIRI","HUANZA"]
[null,"150709","LIMA","HUAROCHIRI","HUAROCHIRI"]
[null,"150710","LIMA","HUAROCHIRI","LAHUAYTAMBO"]
[null,"150711","LIMA","HUAROCHIRI","LANGA"]
[null,"150712","LIMA","HUAROCHIRI","SAN PEDRO DE LARAOS"]
[null,"150713","LIMA","HUAROCHIRI","MARIATANA"]
[null,"150714","LIMA","HUAROCHIRI","RICARDO PALMA"]
[null,"150715","LIMA","HUAROCHIRI","SAN ANDRES DE TUPICOCHA"]
[null,"150716","LIMA","HUAROCHIRI","SAN ANTONIO"]
[null,"150717","LIMA","HUAROCHIRI","SAN BARTOLOME"]
[null,"150718","LIMA","HUAROCHIRI","SAN DAMIAN"]
[null,"150719","LIMA","HUAROCHIRI","SAN JUAN DE IRIS"]
[null,"150720","LIMA","HUAROCHIRI","SAN JUAN DE TANTARANCHE"]
[null,"150721","LIMA","HUAROCHIRI","SAN LORENZO DE QUINTI"]
[null,"150722","LIMA","HUAROCHIRI","SAN MATEO"]
[null,"150723","LIMA","HUAROCHIRI","SAN MATEO DE OTAO"]
[null,"150724","LIMA","HUAROCHIRI","SAN PEDRO DE CASTA"]
[null,"150725","LIMA","HUAROCHIRI","SAN PEDRO DE HUANCAYRE"]
[null,"150726","LIMA","HUAROCHIRI","SANGALLAYA"]
[null,"150727","LIMA","HUAROCHIRI","SANTA CRUZ DE COCACHACRA"]
[null,"150728","LIMA","HUAROCHIRI","SANTA EULALIA"]
[null,"150729","LIMA","HUAROCHIRI","SANTIAGO DE ANCHUCAYA"]
[null,"150730","LIMA","HUAROCHIRI","SANTIAGO DE TUNA"]
[null,"150731","LIMA","HUAROCHIRI","SANTO DOMINGO DE LOS OLLEROS"]
[null,"150732","LIMA","HUAROCHIRI","SURCO"]
[null,"150801","LIMA","HUAURA","HUACHO"]
[null,"150802","LIMA","HUAURA","AMBAR"]
[null,"150803","LIMA","HUAURA","CALETA DE CARQUIN"]
[null,"150804","LIMA","HUAURA","CHECRAS"]
[null,"150805","LIMA","HUAURA","HUALMAY"]
[null,"150806","LIMA","HUAURA","HUAURA"]
[null,"150807","LIMA","HUAURA","LEONCIO PRADO"]
[null,"150808","LIMA","HUAURA","PACCHO"]
[null,"150809","LIMA","HUAURA","SANTA LEONOR"]
[null,"150810","LIMA","HUAURA","SANTA MARIA"]
[null,"150811","LIMA","HUAURA","SAYAN"]
[null,"150812","LIMA","HUAURA","VEGUETA"]
[null,"150901","LIMA","OYON","OYON"]
[null,"150902","LIMA","OYON","ANDAJES"]
[null,"150903","LIMA","OYON","CAUJUL"]
[null,"150904","LIMA","OYON","COCHAMARCA"]
[null,"150905","LIMA","OYON","NAVAN"]
[null,"150906","LIMA","OYON","PACHANGARA"]
[null,"151001","LIMA","YAUYOS","YAUYOS"]
[null,"151002","LIMA","YAUYOS","ALIS"]
[null,"151003","LIMA","YAUYOS","ALLAUCA"]
[null,"151004","LIMA","YAUYOS","AYAVIRI"]
[null,"151005","LIMA","YAUYOS","AZANGARO"]
[null,"151006","LIMA","YAUYOS","CACRA"]
[null,"151007","LIMA","YAUYOS","CARANIA"]
[null,"151008","LIMA","YAUYOS","CATAHUASI"]
[null,"151009","LIMA","YAUYOS","CHOCOS"]
[null,"151010","LIMA","YAUYOS","COCHAS"]
[null,"151011","LIMA","YAUYOS","COLONIA"]
[null,"151012","LIMA","YAUYOS","HONGOS"]
[null,"151013","LIMA","YAUYOS","HUAMPARA"]
[null,"151014","LIMA","YAUYOS","HUANCAYA"]
[null,"151015","LIMA","YAUYOS","HUANGASCAR"]
[null,"151016","LIMA","YAUYOS","HUANTAN"]
[null,"151017","LIMA","YAUYOS","HUAÑEC"]
[null,"151018","LIMA","YAUYOS","LARAOS"]
[null,"151019","LIMA","YAUYOS","LINCHA"]
[null,"151020","LIMA","YAUYOS","MADEAN"]
[null,"151021","LIMA","YAUYOS","MIRAFLORES"]
[null,"151022","LIMA","YAUYOS","OMAS"]
[null,"151023","LIMA","YAUYOS","PUTINZA"]
[null,"151024","LIMA","YAUYOS","QUINCHES"]
[null,"151025","LIMA","YAUYOS","QUINOCAY"]
[null,"151026","LIMA","YAUYOS","SAN JOAQUIN"]
[null,"151027","LIMA","YAUYOS","SAN PEDRO DE PILAS"]
[null,"151028","LIMA","YAUYOS","TANTA"]
[null,"151029","LIMA","YAUYOS","TAURIPAMPA"]
[null,"151030","LIMA","YAUYOS","TOMAS"]
[null,"151031","LIMA","YAUYOS","TUPE"]
[null,"151032","LIMA","YAUYOS","VIÑAC"]
[null,"151033","LIMA","YAUYOS","VITIS"]
[null,"160101","LORETO","MAYNAS","IQUITOS"]
[null,"160102","LORETO","MAYNAS","ALTO NANAY"]
[null,"160103","LORETO","MAYNAS","FERNANDO LORES"]
[null,"160104","LORETO","MAYNAS","INDIANA"]
[null,"160105","LORETO","MAYNAS","LAS AMAZONAS"]
[null,"160106","LORETO","MAYNAS","MAZAN"]
[null,"160107","LORETO","MAYNAS","NAPO"]
[null,"160108","LORETO","MAYNAS","PUNCHANA"]
[null,"160110","LORETO","MAYNAS","TORRES CAUSANA"]
[null,"160112","LORETO","MAYNAS","BELEN"]
[null,"160113","LORETO","MAYNAS","SAN JUAN BAUTISTA"]
[null,"160201","LORETO","ALTO AMAZONAS","YURIMAGUAS"]
[null,"160202","LORETO","ALTO AMAZONAS","BALSAPUERTO"]
[null,"160205","LORETO","ALTO AMAZONAS","JEBEROS"]
[null,"160206","LORETO","ALTO AMAZONAS","LAGUNAS"]
[null,"160210","LORETO","ALTO AMAZONAS","SANTA CRUZ"]
[null,"160211","LORETO","ALTO AMAZONAS","TENIENTE CESAR LOPEZ ROJAS"]
[null,"160301","LORETO","LORETO","NAUTA"]
[null,"160302","LORETO","LORETO","PARINARI"]
[null,"160303","LORETO","LORETO","TIGRE"]
[null,"160304","LORETO","LORETO","TROMPETEROS"]
[null,"160305","LORETO","LORETO","URARINAS"]
[null,"160401","LORETO","MARISCAL RAMON CASTILLA","RAMON CASTILLA"]
[null,"160402","LORETO","MARISCAL RAMON CASTILLA","PEBAS"]
[null,"160403","LORETO","MARISCAL RAMON CASTILLA","YAVARI"]
[null,"160404","LORETO","MARISCAL RAMON CASTILLA","SAN PABLO"]
[null,"160405","LORETO","MARISCAL RAMON CASTILLA","SANTA ROSA DE LORETO"]
[null,"160501","LORETO","REQUENA","REQUENA"]
[null,"160502","LORETO","REQUENA","ALTO TAPICHE"]
[null,"160503","LORETO","REQUENA","CAPELO"]
[null,"160504","LORETO","REQUENA","EMILIO SAN MARTIN"]
[null,"160505","LORETO","REQUENA","MAQUIA"]
[null,"160506","LORETO","REQUENA","PUINAHUA"]
[null,"160507","LORETO","REQUENA","SAQUENA"]
[null,"160508","LORETO","REQUENA","SOPLIN"]
[null,"160509","LORETO","REQUENA","TAPICHE"]
[null,"160510","LORETO","REQUENA","JENARO HERRERA"]
[null,"160511","LORETO","REQUENA","YAQUERANA"]
[null,"160601","LORETO","UCAYALI","CONTAMANA"]
[null,"160602","LORETO","UCAYALI","INAHUAYA"]
[null,"160603","LORETO","UCAYALI","PADRE MARQUEZ"]
[null,"160604","LORETO","UCAYALI","PAMPA HERMOSA"]
[null,"160605","LORETO","UCAYALI","SARAYACU"]
[null,"160606","LORETO","UCAYALI","VARGAS GUERRA"]
[null,"160701","LORETO","DATEM DEL MARAÑON","BARRANCA"]
[null,"160702","LORETO","DATEM DEL MARAÑON","CAHUAPANAS"]
[null,"160703","LORETO","DATEM DEL MARAÑON","MANSERICHE"]
[null,"160704","LORETO","DATEM DEL MARAÑON","MORONA"]
[null,"160705","LORETO","DATEM DEL MARAÑON","PASTAZA"]
[null,"160706","LORETO","DATEM DEL MARAÑON","ANDOAS"]
[null,"160801","LORETO","PUTUMAYO","PUTUMAYO"]
[null,"160802","LORETO","PUTUMAYO","ROSA PANDURO"]
[null,"160803","LORETO","PUTUMAYO","TENIENTE MANUEL CLAVERO"]
[null,"160804","LORETO","PUTUMAYO","YAGUAS"]
[null,"170101","MADRE DE DIOS","TAMBOPATA","TAMBOPATA"]
[null,"170102","MADRE DE DIOS","TAMBOPATA","INAMBARI"]
[null,"170103","MADRE DE DIOS","TAMBOPATA","LAS PIEDRAS"]
[null,"170104","MADRE DE DIOS","TAMBOPATA","LABERINTO"]
[null,"170201","MADRE DE DIOS","MANU","MANU"]
[null,"170202","MADRE DE DIOS","MANU","FITZCARRALD"]
[null,"170203","MADRE DE DIOS","MANU","MADRE DE DIOS"]
[null,"170204","MADRE DE DIOS","MANU","HUEPETUHE"]
[null,"170301","MADRE DE DIOS","TAHUAMANU","IÑAPARI"]
[null,"170302","MADRE DE DIOS","TAHUAMANU","IBERIA"]
[null,"170303","MADRE DE DIOS","TAHUAMANU","TAHUAMANU"]
[null,"180101","MOQUEGUA","MARISCAL NIETO","MOQUEGUA"]
[null,"180102","MOQUEGUA","MARISCAL NIETO","CARUMAS"]
[null,"180103","MOQUEGUA","MARISCAL NIETO","CUCHUMBAYA"]
[null,"180104","MOQUEGUA","MARISCAL NIETO","SAMEGUA"]
[null,"180105","MOQUEGUA","MARISCAL NIETO","SAN CRISTOBAL"]
[null,"180106","MOQUEGUA","MARISCAL NIETO","TORATA"]
[null,"180107","MOQUEGUA","MARISCAL NIETO","SAN ANTONIO"]
[null,"180201","MOQUEGUA","GENERAL SANCHEZ CERRO","OMATE"]
[null,"180202","MOQUEGUA","GENERAL SANCHEZ CERRO","CHOJATA"]
[null,"180203","MOQUEGUA","GENERAL SANCHEZ CERRO","COALAQUE"]
[null,"180204","MOQUEGUA","GENERAL SANCHEZ CERRO","ICHUÑA"]
[null,"180205","MOQUEGUA","GENERAL SANCHEZ CERRO","LA CAPILLA"]
[null,"180206","MOQUEGUA","GENERAL SANCHEZ CERRO","LLOQUE"]
[null,"180207","MOQUEGUA","GENERAL SANCHEZ CERRO","MATALAQUE"]
[null,"180208","MOQUEGUA","GENERAL SANCHEZ CERRO","PUQUINA"]
[null,"180209","MOQUEGUA","GENERAL SANCHEZ CERRO","QUINISTAQUILLAS"]
[null,"180210","MOQUEGUA","GENERAL SANCHEZ CERRO","UBINAS"]
[null,"180211","MOQUEGUA","GENERAL SANCHEZ CERRO","YUNGA"]
[null,"180301","MOQUEGUA","ILO","ILO"]
[null,"180302","MOQUEGUA","ILO","EL ALGARROBAL"]
[null,"180303","MOQUEGUA","ILO","PACOCHA"]
[null,"190101","PASCO","PASCO","CHAUPIMARCA"]
[null,"190102","PASCO","PASCO","HUACHON"]
[null,"190103","PASCO","PASCO","HUARIACA"]
[null,"190104","PASCO","PASCO","HUAYLLAY"]
[null,"190105","PASCO","PASCO","NINACACA"]
[null,"190106","PASCO","PASCO","PALLANCHACRA"]
[null,"190107","PASCO","PASCO","PAUCARTAMBO"]
[null,"190108","PASCO","PASCO","SAN FRANCISCO DE ASIS DE YARUSYACAN"]
[null,"190109","PASCO","PASCO","SIMON BOLIVAR"]
[null,"190110","PASCO","PASCO","TICLACAYAN"]
[null,"190111","PASCO","PASCO","TINYAHUARCO"]
[null,"190112","PASCO","PASCO","VICCO"]
[null,"190113","PASCO","PASCO","YANACANCHA"]
[null,"190201","PASCO","DANIEL ALCIDES CARRION","YANAHUANCA"]
[null,"190202","PASCO","DANIEL ALCIDES CARRION","CHACAYAN"]
[null,"190203","PASCO","DANIEL ALCIDES CARRION","GOYLLARISQUIZGA"]
[null,"190204","PASCO","DANIEL ALCIDES CARRION","PAUCAR"]
[null,"190205","PASCO","DANIEL ALCIDES CARRION","SAN PEDRO DE PILLAO"]
[null,"190206","PASCO","DANIEL ALCIDES CARRION","SANTA ANA DE TUSI"]
[null,"190207","PASCO","DANIEL ALCIDES CARRION","TAPUC"]
[null,"190208","PASCO","DANIEL ALCIDES CARRION","VILCABAMBA"]
[null,"190301","PASCO","OXAPAMPA","OXAPAMPA"]
[null,"190302","PASCO","OXAPAMPA","CHONTABAMBA"]
[null,"190303","PASCO","OXAPAMPA","HUANCABAMBA"]
[null,"190304","PASCO","OXAPAMPA","PALCAZU"]
[null,"190305","PASCO","OXAPAMPA","POZUZO"]
[null,"190306","PASCO","OXAPAMPA","PUERTO BERMUDEZ"]
[null,"190307","PASCO","OXAPAMPA","VILLA RICA"]
[null,"190308","PASCO","OXAPAMPA","CONSTITUCIÓN"]
[null,"200101","PIURA","PIURA","PIURA"]
[null,"200104","PIURA","PIURA","CASTILLA"]
[null,"200105","PIURA","PIURA","CATACAOS"]
[null,"200107","PIURA","PIURA","CURA MORI"]
[null,"200108","PIURA","PIURA","EL TALLÁN"]
[null,"200109","PIURA","PIURA","LA ARENA"]
[null,"200110","PIURA","PIURA","LA UNION"]
[null,"200111","PIURA","PIURA","LAS LOMAS"]
[null,"200114","PIURA","PIURA","TAMBO GRANDE"]
[null,"200115","PIURA","PIURA","VEINTISEIS DE OCTUBRE"]
[null,"200201","PIURA","AYABACA","AYABACA"]
[null,"200202","PIURA","AYABACA","FRIAS"]
[null,"200203","PIURA","AYABACA","JILILI"]
[null,"200204","PIURA","AYABACA","LAGUNAS"]
[null,"200205","PIURA","AYABACA","MONTERO"]
[null,"200206","PIURA","AYABACA","PACAIPAMPA"]
[null,"200207","PIURA","AYABACA","PAIMAS"]
[null,"200208","PIURA","AYABACA","SAPILLICA"]
[null,"200209","PIURA","AYABACA","SICCHEZ"]
[null,"200210","PIURA","AYABACA","SUYO"]
[null,"200301","PIURA","HUANCABAMBA","HUANCABAMBA"]
[null,"200302","PIURA","HUANCABAMBA","CANCHAQUE"]
[null,"200303","PIURA","HUANCABAMBA","EL CARMEN DE LA FRONTERA"]
[null,"200304","PIURA","HUANCABAMBA","HUARMACA"]
[null,"200305","PIURA","HUANCABAMBA","LALAQUIZ"]
[null,"200306","PIURA","HUANCABAMBA","SAN MIGUEL DE EL FAIQUE"]
[null,"200307","PIURA","HUANCABAMBA","SONDOR"]
[null,"200308","PIURA","HUANCABAMBA","SONDORILLO"]
[null,"200401","PIURA","MORROPON","CHULUCANAS"]
[null,"200402","PIURA","MORROPON","BUENOS AIRES"]
[null,"200403","PIURA","MORROPON","CHALACO"]
[null,"200404","PIURA","MORROPON","LA MATANZA"]
[null,"200405","PIURA","MORROPON","MORROPON"]
[null,"200406","PIURA","MORROPON","SALITRAL"]
[null,"200407","PIURA","MORROPON","SAN JUAN DE BIGOTE"]
[null,"200408","PIURA","MORROPON","SANTA CATALINA DE MOSSA"]
[null,"200409","PIURA","MORROPON","SANTO DOMINGO"]
[null,"200410","PIURA","MORROPON","YAMANGO"]
[null,"200501","PIURA","PAITA","PAITA"]
[null,"200502","PIURA","PAITA","AMOTAPE"]
[null,"200503","PIURA","PAITA","ARENAL"]
[null,"200504","PIURA","PAITA","COLAN"]
[null,"200505","PIURA","PAITA","LA HUACA"]
[null,"200506","PIURA","PAITA","TAMARINDO"]
[null,"200507","PIURA","PAITA","VICHAYAL"]
[null,"200601","PIURA","SULLANA","SULLANA"]
[null,"200602","PIURA","SULLANA","BELLAVISTA"]
[null,"200603","PIURA","SULLANA","IGNACIO ESCUDERO"]
[null,"200604","PIURA","SULLANA","LANCONES"]
[null,"200605","PIURA","SULLANA","MARCAVELICA"]
[null,"200606","PIURA","SULLANA","MIGUEL CHECA"]
[null,"200607","PIURA","SULLANA","QUERECOTILLO"]
[null,"200608","PIURA","SULLANA","SALITRAL"]
[null,"200701","PIURA","TALARA","PARIÑAS"]
[null,"200702","PIURA","TALARA","EL ALTO"]
[null,"200703","PIURA","TALARA","LA BREA"]
[null,"200704","PIURA","TALARA","LOBITOS"]
[null,"200705","PIURA","TALARA","LOS ORGANOS"]
[null,"200706","PIURA","TALARA","MANCORA"]
[null,"200801","PIURA","SECHURA","SECHURA"]
[null,"200802","PIURA","SECHURA","BELLAVISTA DE LA UNION"]
[null,"200803","PIURA","SECHURA","BERNAL"]
[null,"200804","PIURA","SECHURA","CRISTO NOS VALGA"]
[null,"200805","PIURA","SECHURA","VICE"]
[null,"200806","PIURA","SECHURA","RINCONADA LLICUAR"]
[null,"210101","PUNO","PUNO","PUNO"]
[null,"210102","PUNO","PUNO","ACORA"]
[null,"210103","PUNO","PUNO","AMANTANI"]
[null,"210104","PUNO","PUNO","ATUNCOLLA"]
[null,"210105","PUNO","PUNO","CAPACHICA"]
[null,"210106","PUNO","PUNO","CHUCUITO"]
[null,"210107","PUNO","PUNO","COATA"]
[null,"210108","PUNO","PUNO","HUATA"]
[null,"210109","PUNO","PUNO","MAÑAZO"]
[null,"210110","PUNO","PUNO","PAUCARCOLLA"]
[null,"210111","PUNO","PUNO","PICHACANI"]
[null,"210112","PUNO","PUNO","PLATERIA"]
[null,"210113","PUNO","PUNO","SAN ANTONIO"]
[null,"210114","PUNO","PUNO","TIQUILLACA"]
[null,"210115","PUNO","PUNO","VILQUE"]
[null,"210201","PUNO","AZANGARO","AZANGARO"]
[null,"210202","PUNO","AZANGARO","ACHAYA"]
[null,"210203","PUNO","AZANGARO","ARAPA"]
[null,"210204","PUNO","AZANGARO","ASILLO"]
[null,"210205","PUNO","AZANGARO","CAMINACA"]
[null,"210206","PUNO","AZANGARO","CHUPA"]
[null,"210207","PUNO","AZANGARO","JOSE DOMINGO CHOQUEHUANCA"]
[null,"210208","PUNO","AZANGARO","MUÑANI"]
[null,"210209","PUNO","AZANGARO","POTONI"]
[null,"210210","PUNO","AZANGARO","SAMAN"]
[null,"210211","PUNO","AZANGARO","SAN ANTON"]
[null,"210212","PUNO","AZANGARO","SAN JOSE"]
[null,"210213","PUNO","AZANGARO","SAN JUAN DE SALINAS"]
[null,"210214","PUNO","AZANGARO","SANTIAGO DE PUPUJA"]
[null,"210215","PUNO","AZANGARO","TIRAPATA"]
[null,"210301","PUNO","CARABAYA","MACUSANI"]
[null,"210302","PUNO","CARABAYA","AJOYANI"]
[null,"210303","PUNO","CARABAYA","AYAPATA"]
[null,"210304","PUNO","CARABAYA","COASA"]
[null,"210305","PUNO","CARABAYA","CORANI"]
[null,"210306","PUNO","CARABAYA","CRUCERO"]
[null,"210307","PUNO","CARABAYA","ITUATA"]
[null,"210308","PUNO","CARABAYA","OLLACHEA"]
[null,"210309","PUNO","CARABAYA","SAN GABAN"]
[null,"210310","PUNO","CARABAYA","USICAYOS"]
[null,"210401","PUNO","CHUCUITO","JULI"]
[null,"210402","PUNO","CHUCUITO","DESAGUADERO"]
[null,"210403","PUNO","CHUCUITO","HUACULLANI"]
[null,"210404","PUNO","CHUCUITO","KELLUYO"]
[null,"210405","PUNO","CHUCUITO","PISACOMA"]
[null,"210406","PUNO","CHUCUITO","POMATA"]
[null,"210407","PUNO","CHUCUITO","ZEPITA"]
[null,"210501","PUNO","EL COLLAO","ILAVE"]
[null,"210502","PUNO","EL COLLAO","CAPAZO"]
[null,"210503","PUNO","EL COLLAO","PILCUYO"]
[null,"210504","PUNO","EL COLLAO","SANTA ROSA"]
[null,"210505","PUNO","EL COLLAO","CONDURIRI"]
[null,"210601","PUNO","HUANCANE","HUANCANE"]
[null,"210602","PUNO","HUANCANE","COJATA"]
[null,"210603","PUNO","HUANCANE","HUATASANI"]
[null,"210604","PUNO","HUANCANE","INCHUPALLA"]
[null,"210605","PUNO","HUANCANE","PUSI"]
[null,"210606","PUNO","HUANCANE","ROSASPATA"]
[null,"210607","PUNO","HUANCANE","TARACO"]
[null,"210608","PUNO","HUANCANE","VILQUE CHICO"]
[null,"210701","PUNO","LAMPA","LAMPA"]
[null,"210702","PUNO","LAMPA","CABANILLA"]
[null,"210703","PUNO","LAMPA","CALAPUJA"]
[null,"210704","PUNO","LAMPA","NICASIO"]
[null,"210705","PUNO","LAMPA","OCUVIRI"]
[null,"210706","PUNO","LAMPA","PALCA"]
[null,"210707","PUNO","LAMPA","PARATIA"]
[null,"210708","PUNO","LAMPA","PUCARA"]
[null,"210709","PUNO","LAMPA","SANTA LUCIA"]
[null,"210710","PUNO","LAMPA","VILAVILA"]
[null,"210801","PUNO","MELGAR","AYAVIRI"]
[null,"210802","PUNO","MELGAR","ANTAUTA"]
[null,"210803","PUNO","MELGAR","CUPI"]
[null,"210804","PUNO","MELGAR","LLALLI"]
[null,"210805","PUNO","MELGAR","MACARI"]
[null,"210806","PUNO","MELGAR","NUÑOA"]
[null,"210807","PUNO","MELGAR","ORURILLO"]
[null,"210808","PUNO","MELGAR","SANTA ROSA"]
[null,"210809","PUNO","MELGAR","UMACHIRI"]
[null,"210901","PUNO","MOHO","MOHO"]
[null,"210902","PUNO","MOHO","CONIMA"]
[null,"210903","PUNO","MOHO","HUAYRAPATA"]
[null,"210904","PUNO","MOHO","TILALI"]
[null,"211001","PUNO","SAN ANTONIO DE PUTINA","PUTINA"]
[null,"211002","PUNO","SAN ANTONIO DE PUTINA","ANANEA"]
[null,"211003","PUNO","SAN ANTONIO DE PUTINA","PEDRO VILCA APAZA"]
[null,"211004","PUNO","SAN ANTONIO DE PUTINA","QUILCAPUNCU"]
[null,"211005","PUNO","SAN ANTONIO DE PUTINA","SINA"]
[null,"211101","PUNO","SAN ROMAN","JULIACA"]
[null,"211102","PUNO","SAN ROMAN","CABANA"]
[null,"211103","PUNO","SAN ROMAN","CABANILLAS"]
[null,"211104","PUNO","SAN ROMAN","CARACOTO"]
[null,"211105","PUNO","SAN ROMAN","SAN MIGUEL"]
[null,"211201","PUNO","SANDIA","SANDIA"]
[null,"211202","PUNO","SANDIA","CUYOCUYO"]
[null,"211203","PUNO","SANDIA","LIMBANI"]
[null,"211204","PUNO","SANDIA","PATAMBUCO"]
[null,"211205","PUNO","SANDIA","PHARA"]
[null,"211206","PUNO","SANDIA","QUIACA"]
[null,"211207","PUNO","SANDIA","SAN JUAN DEL ORO"]
[null,"211208","PUNO","SANDIA","YANAHUAYA"]
[null,"211209","PUNO","SANDIA","ALTO INAMBARI"]
[null,"211210","PUNO","SANDIA","SAN PEDRO DE PUTINA PUNCO"]
[null,"211301","PUNO","YUNGUYO","YUNGUYO"]
[null,"211302","PUNO","YUNGUYO","ANAPIA"]
[null,"211303","PUNO","YUNGUYO","COPANI"]
[null,"211304","PUNO","YUNGUYO","CUTURAPI"]
[null,"211305","PUNO","YUNGUYO","OLLARAYA"]
[null,"211306","PUNO","YUNGUYO","TINICACHI"]
[null,"211307","PUNO","YUNGUYO","UNICACHI"]
[null,"220101","SAN MARTIN","MOYOBAMBA","MOYOBAMBA"]
[null,"220102","SAN MARTIN","MOYOBAMBA","CALZADA"]
[null,"220103","SAN MARTIN","MOYOBAMBA","HABANA"]
[null,"220104","SAN MARTIN","MOYOBAMBA","JEPELACIO"]
[null,"220105","SAN MARTIN","MOYOBAMBA","SORITOR"]
[null,"220106","SAN MARTIN","MOYOBAMBA","YANTALO"]
[null,"220201","SAN MARTIN","BELLAVISTA","BELLAVISTA"]
[null,"220202","SAN MARTIN","BELLAVISTA","ALTO BIAVO"]
[null,"220203","SAN MARTIN","BELLAVISTA","BAJO BIAVO"]
[null,"220204","SAN MARTIN","BELLAVISTA","HUALLAGA"]
[null,"220205","SAN MARTIN","BELLAVISTA","SAN PABLO"]
[null,"220206","SAN MARTIN","BELLAVISTA","SAN RAFAEL"]
[null,"220301","SAN MARTIN","EL DORADO","SAN JOSE DE SISA"]
[null,"220302","SAN MARTIN","EL DORADO","AGUA BLANCA"]
[null,"220303","SAN MARTIN","EL DORADO","SAN MARTIN"]
[null,"220304","SAN MARTIN","EL DORADO","SANTA ROSA"]
[null,"220305","SAN MARTIN","EL DORADO","SHATOJA"]
[null,"220401","SAN MARTIN","HUALLAGA","SAPOSOA"]
[null,"220402","SAN MARTIN","HUALLAGA","ALTO SAPOSOA"]
[null,"220403","SAN MARTIN","HUALLAGA","EL ESLABON"]
[null,"220404","SAN MARTIN","HUALLAGA","PISCOYACU"]
[null,"220405","SAN MARTIN","HUALLAGA","SACANCHE"]
[null,"220406","SAN MARTIN","HUALLAGA","TINGO DE SAPOSOA"]
[null,"220501","SAN MARTIN","LAMAS","LAMAS"]
[null,"220502","SAN MARTIN","LAMAS","ALONSO DE ALVARADO"]
[null,"220503","SAN MARTIN","LAMAS","BARRANQUITA"]
[null,"220504","SAN MARTIN","LAMAS","CAYNARACHI"]
[null,"220505","SAN MARTIN","LAMAS","CUÑUMBUQUI"]
[null,"220506","SAN MARTIN","LAMAS","PINTO RECODO"]
[null,"220507","SAN MARTIN","LAMAS","RUMISAPA"]
[null,"220508","SAN MARTIN","LAMAS","SAN ROQUE DE CUMBAZA"]
[null,"220509","SAN MARTIN","LAMAS","SHANAO"]
[null,"220510","SAN MARTIN","LAMAS","TABALOSOS"]
[null,"220511","SAN MARTIN","LAMAS","ZAPATERO"]
[null,"220601","SAN MARTIN","MARISCAL CACERES","JUANJUI"]
[null,"220602","SAN MARTIN","MARISCAL CACERES","CAMPANILLA"]
[null,"220603","SAN MARTIN","MARISCAL CACERES","HUICUNGO"]
[null,"220604","SAN MARTIN","MARISCAL CACERES","PACHIZA"]
[null,"220605","SAN MARTIN","MARISCAL CACERES","PAJARILLO"]
[null,"220701","SAN MARTIN","PICOTA","PICOTA"]
[null,"220702","SAN MARTIN","PICOTA","BUENOS AIRES"]
[null,"220703","SAN MARTIN","PICOTA","CASPISAPA"]
[null,"220704","SAN MARTIN","PICOTA","PILLUANA"]
[null,"220705","SAN MARTIN","PICOTA","PUCACACA"]
[null,"220706","SAN MARTIN","PICOTA","SAN CRISTOBAL"]
[null,"220707","SAN MARTIN","PICOTA","SAN HILARION"]
[null,"220708","SAN MARTIN","PICOTA","SHAMBOYACU"]
[null,"220709","SAN MARTIN","PICOTA","TINGO DE PONASA"]
[null,"220710","SAN MARTIN","PICOTA","TRES UNIDOS"]
[null,"220801","SAN MARTIN","RIOJA","RIOJA"]
[null,"220802","SAN MARTIN","RIOJA","AWAJUN"]
[null,"220803","SAN MARTIN","RIOJA","ELIAS SOPLIN VARGAS"]
[null,"220804","SAN MARTIN","RIOJA","NUEVA CAJAMARCA"]
[null,"220805","SAN MARTIN","RIOJA","PARDO MIGUEL"]
[null,"220806","SAN MARTIN","RIOJA","POSIC"]
[null,"220807","SAN MARTIN","RIOJA","SAN FERNANDO"]
[null,"220808","SAN MARTIN","RIOJA","YORONGOS"]
[null,"220809","SAN MARTIN","RIOJA","YURACYACU"]
[null,"220901","SAN MARTIN","SAN MARTIN","TARAPOTO"]
[null,"220902","SAN MARTIN","SAN MARTIN","ALBERTO LEVEAU"]
[null,"220903","SAN MARTIN","SAN MARTIN","CACATACHI"]
[null,"220904","SAN MARTIN","SAN MARTIN","CHAZUTA"]
[null,"220905","SAN MARTIN","SAN MARTIN","CHIPURANA"]
[null,"220906","SAN MARTIN","SAN MARTIN","EL PORVENIR"]
[null,"220907","SAN MARTIN","SAN MARTIN","HUIMBAYOC"]
[null,"220908","SAN MARTIN","SAN MARTIN","JUAN GUERRA"]
[null,"220909","SAN MARTIN","SAN MARTIN","LA BANDA DE SHILCAYO"]
[null,"220910","SAN MARTIN","SAN MARTIN","MORALES"]
[null,"220911","SAN MARTIN","SAN MARTIN","PAPAPLAYA"]
[null,"220912","SAN MARTIN","SAN MARTIN","SAN ANTONIO"]
[null,"220913","SAN MARTIN","SAN MARTIN","SAUCE"]
[null,"220914","SAN MARTIN","SAN MARTIN","SHAPAJA"]
[null,"221001","SAN MARTIN","TOCACHE","TOCACHE"]
[null,"221002","SAN MARTIN","TOCACHE","NUEVO PROGRESO"]
[null,"221003","SAN MARTIN","TOCACHE","POLVORA"]
[null,"221004","SAN MARTIN","TOCACHE","SHUNTE"]
[null,"221005","SAN MARTIN","TOCACHE","UCHIZA"]
[null,"221006","SAN MARTIN","TOCACHE","SANTA LUCIA"]
[null,"230101","TACNA","TACNA","TACNA"]
[null,"230102","TACNA","TACNA","ALTO DE LA ALIANZA"]
[null,"230103","TACNA","TACNA","CALANA"]
[null,"230104","TACNA","TACNA","CIUDAD NUEVA"]
[null,"230105","TACNA","TACNA","INCLAN"]
[null,"230106","TACNA","TACNA","PACHIA"]
[null,"230107","TACNA","TACNA","PALCA"]
[null,"230108","TACNA","TACNA","POCOLLAY"]
[null,"230109","TACNA","TACNA","SAMA"]
[null,"230110","TACNA","TACNA","CORONEL GREGORIO ALBARRACIN LANCHIPA"]
[null,"230111","TACNA","TACNA","LA YARADA LOS PALOS"]
[null,"230201","TACNA","CANDARAVE","CANDARAVE"]
[null,"230202","TACNA","CANDARAVE","CAIRANI"]
[null,"230203","TACNA","CANDARAVE","CAMILACA"]
[null,"230204","TACNA","CANDARAVE","CURIBAYA"]
[null,"230205","TACNA","CANDARAVE","HUANUARA"]
[null,"230206","TACNA","CANDARAVE","QUILAHUANI"]
[null,"230301","TACNA","JORGE BASADRE","LOCUMBA"]
[null,"230302","TACNA","JORGE BASADRE","ILABAYA"]
[null,"230303","TACNA","JORGE BASADRE","ITE"]
[null,"230401","TACNA","TARATA","TARATA"]
[null,"230402","TACNA","TARATA","HEROES ALBARRACIN"]
[null,"230403","TACNA","TARATA","ESTIQUE"]
[null,"230404","TACNA","TARATA","ESTIQUE-PAMPA"]
[null,"230405","TACNA","TARATA","SITAJARA"]
[null,"230406","TACNA","TARATA","SUSAPAYA"]
[null,"230407","TACNA","TARATA","TARUCACHI"]
[null,"230408","TACNA","TARATA","TICACO"]
[null,"240101","TUMBES","TUMBES","TUMBES"]
[null,"240102","TUMBES","TUMBES","CORRALES"]
[null,"240103","TUMBES","TUMBES","LA CRUZ"]
[null,"240104","TUMBES","TUMBES","PAMPAS DE HOSPITAL"]
[null,"240105","TUMBES","TUMBES","SAN JACINTO"]
[null,"240106","TUMBES","TUMBES","SAN JUAN DE LA VIRGEN"]
[null,"240201","TUMBES","CONTRALMIRANTE VILLAR","ZORRITOS"]
[null,"240202","TUMBES","CONTRALMIRANTE VILLAR","CASITAS"]
[null,"240203","TUMBES","CONTRALMIRANTE VILLAR","CANOAS DE PUNTA SAL"]
[null,"240301","TUMBES","ZARUMILLA","ZARUMILLA"]
[null,"240302","TUMBES","ZARUMILLA","AGUAS VERDES"]
[null,"240303","TUMBES","ZARUMILLA","MATAPALO"]
[null,"240304","TUMBES","ZARUMILLA","PAPAYAL"]
[null,"250101","UCAYALI","CORONEL PORTILLO","CALLERIA"]
[null,"250102","UCAYALI","CORONEL PORTILLO","CAMPOVERDE"]
[null,"250103","UCAYALI","CORONEL PORTILLO","IPARIA"]
[null,"250104","UCAYALI","CORONEL PORTILLO","MASISEA"]
[null,"250105","UCAYALI","CORONEL PORTILLO","YARINACOCHA"]
[null,"250106","UCAYALI","CORONEL PORTILLO","NUEVA REQUENA"]
[null,"250107","UCAYALI","CORONEL PORTILLO","MANANTAY"]
[null,"250201","UCAYALI","ATALAYA","RAYMONDI"]
[null,"250202","UCAYALI","ATALAYA","SEPAHUA"]
[null,"250203","UCAYALI","ATALAYA","TAHUANIA"]
[null,"250204","UCAYALI","ATALAYA","YURUA"]
[null,"250301","UCAYALI","PADRE ABAD","PADRE ABAD"]
[null,"250302","UCAYALI","PADRE ABAD","IRAZOLA"]
[null,"250303","UCAYALI","PADRE ABAD","CURIMANA"]
[null,"250304","UCAYALI","PADRE ABAD","NESHUYA"]
[null,"250305","UCAYALI","PADRE ABAD","ALEXANDER VON HUMBOLDT"]
[null,"250306","UCAYALI","PADRE ABAD","HUIPOCA"]
[null,"250307","UCAYALI","PADRE ABAD","BOQUERON"]
[null,"250401","UCAYALI","PURUS","PURUS"]